program: Orca
programVersion: 5.0.2
elementType: O O O O N N N C C C C C C C C C C C C C C C C C C C C C C C C H H H H H H H H H H H H H H H H H H H H H H H H H H H
charge: 0
multiplicity: 1
keywords: wb97x-d3
keywords: def2-TZVPP
keywords: def2/J RIJCOSX
keywords: DEFGRID2
keywords: scfconv7
keywords: smallprint printgap noloewdin
keywords: NOSOSCF
formula: C24H27N3O4
InChI: InChI=1/C24H27N3O4/c1-17-21(22(27(5)26-17)30-20-9-7-6-8-10-20)15-25-29-16-18-11-13-19(14-12-18)23(28)31-24(2,3)4/h6-15H,16H2,1-5H3
58 atoms
O  4.097201 -0.274366 0.389223
O  -2.964884 -1.145404 -1.246994
O  -2.007048 3.073686 -0.619366
O  4.754126 1.717957 1.198128
N  -4.486546 -1.816792 0.39023
N  -5.185447 -1.335958 1.421245
N  -2.413332 1.773427 -0.557879
C  5.265564 -1.026478 0.796998
C  5.439036 -1.002313 2.311859
C  6.510935 -0.522987 0.07583
C  4.940228 -2.443408 0.338942
C  3.964421 1.029653 0.605653
C  2.700571 1.556519 0.023153
C  -3.912284 0.299825 0.529375
C  -3.712105 -0.873342 -0.168335
C  -4.859698 -0.064816 1.517405
C  0.345198 2.635021 -1.0250
C  1.854236 0.774674 -0.756643
C  2.365853 2.885389 0.269562
C  0.688205 1.311866 -1.274466
C  1.197001 3.413803 -0.2470
C  -0.945127 3.202284 -1.545956
C  -5.468001 0.804305 2.562095
C  -3.312987 1.596986 0.321261
C  -4.559018 -3.209634 0.032725
C  -1.69399 -1.627814 -1.074066
C  -1.071827 -1.710655 0.162463
C  -1.043914 -2.050208 -2.225311
C  0.209113 -2.238555 0.238458
C  0.234991 -2.574145 -2.131185
C  0.866057 -2.679431 -0.899214
H  6.217021 -1.712817 2.59532
H  5.728731 -0.022463 2.682134
H  4.519351 -1.306038 2.814206
H  7.346234 -1.192572 0.285678
H  6.358742 -0.515877 -1.004452
H  6.797827 0.476797 0.392723
H  4.043732 -2.822127 0.832721
H  5.763283 -3.115131 0.581928
H  4.782081 -2.48451 -0.739653
H  2.093698 -0.256824 -0.964713
H  3.02485 3.499373 0.868199
H  0.034564 0.688318 -1.870289
H  0.943751 4.447473 -0.043938
H  -1.217006 2.733466 -2.496275
H  -0.851456 4.276465 -1.714167
H  -6.032827 1.627464 2.121815
H  -6.149272 0.223018 3.179983
H  -4.710128 1.24043 3.214481
H  -3.6671 2.418725 0.944547
H  -4.581115 -3.323967 -1.048806
H  -5.474378 -3.613745 0.453432
H  -3.707882 -3.765149 0.428094
H  -1.562436 -1.353306 1.058489
H  -1.542383 -1.967052 -3.182256
H  0.69924 -2.291072 1.201535
H  0.739163 -2.905082 -3.029585
H  1.865597 -3.087069 -0.828345
totalener: -1396.02830129 hartree
nucrepener: 3069.40164817 hartree
electener: -4465.42994946 hartree
oneelecener: -8002.41836791 hartree
twoeener: 3536.98841845 hartree
kineticenergy: 1390.10876451 hartree
xcener: -134.858893995035 hartree
chargesum: -0.0000000
charge: -0.274495 -0.286183 -0.205908 -0.389201 0.132733 -0.293085 -0.126036 0.235299 -0.297718 -0.299081 -0.280675 0.454975 -0.016927 -0.100635 0.142054 0.095255 -0.037973 -0.185828 -0.140569 -0.108974 -0.122486 0.055962 -0.291259 0.070175 -0.180792 0.243551 -0.111008 -0.245546 -0.137703 -0.059526 -0.183835 0.086360 0.118460 0.091669 0.086910 0.093994 0.116704 0.090048 0.092138 0.097093 0.146301 0.132243 0.137179 0.108558 0.089298 0.093088 0.098097 0.102142 0.099036 0.075791 0.118191 0.120164 0.110897 0.132282 0.124556 0.122983 0.125466 0.135791
qa: -0.2745 -0.2862 -0.2059 -0.3892 0.1327 -0.2931 -0.1260 0.2353 -0.2977 -0.2991 -0.2807 0.4550 -0.0169 -0.1006 0.1421 0.0953 -0.0380 -0.1858 -0.1406 -0.1090 -0.1225 0.0560 -0.2913 0.0702 -0.1808 0.2436 -0.1110 -0.2455 -0.1377 -0.0595 -0.1838 0.0864 0.1185 0.0917 0.0869 0.0940 0.1167 0.0900 0.0921 0.0971 0.1463 0.1322 0.1372 0.1086 0.0893 0.0931 0.0981 0.1021 0.0990 0.0758 0.1182 0.1202 0.1109 0.1323 0.1246 0.1230 0.1255 0.1358
va: 2.1440 2.1195 1.9723 2.1172 3.2903 2.9218 2.9335 3.8742 3.9009 3.9041 3.9042 4.1170 3.7394 3.5585 4.1882 3.9193 3.7544 4.0324 4.0364 3.9224 3.9617 3.9262 3.9408 4.0452 3.8984 3.7295 3.8559 4.0045 3.9175 3.9024 3.9233 1.0058 1.0219 1.0088 1.0058 1.0090 1.0206 1.0065 1.0161 1.0076 1.0172 1.0266 0.9976 1.0128 1.0088 0.9962 0.9919 1.0179 0.9917 1.0371 0.9924 1.0110 0.9866 1.0078 1.0171 1.0035 0.9994 0.9931
dispcorr: -0.032527659 hartree
energy: -1396.060828947008
dipole: 20.93860 -20.98116 -0.04256 -12.59965 11.40489 -1.19476 6.25135 -6.64056 -0.38921
magnitude: 1.25727 au
magnitude: 3.19574 debye
