program: Orca
programVersion: 5.0.2
elementType: O O O O N N N C C C C C C C C C C C C C C C C C C C C H H H H H H H H H H H H H H H H H H H
charge: 0
multiplicity: 1
keywords: wb97x-d3
keywords: def2-TZVPP
keywords: def2/J RIJCOSX
keywords: DEFGRID2
keywords: scfconv7
keywords: smallprint printgap noloewdin
keywords: NOSOSCF
formula: C20H19N3O4
InChI: InChI=1/C20H19N3O4/c1-14-18(19(23(2)22-14)27-17-6-4-3-5-7-17)12-21-26-13-15-8-10-16(11-9-15)20(24)25/h3-12,24H,13H2,1-2H3
46 atoms
O  2.039266 -0.476442 -1.222209
O  0.865781 1.820501 -0.194892
O  -6.098387 -0.300805 -0.7473
O  -5.583846 -0.76079 1.373236
N  4.224227 -0.815086 -0.563137
N  5.113499 -0.467669 0.377148
N  1.154237 1.999857 1.129528
C  3.138257 0.549906 0.78053
C  3.033898 -0.236171 -0.360107
C  4.476851 0.336929 1.197987
C  5.149162 0.931196 2.38223
C  4.591214 -1.765072 -1.586856
C  2.210762 1.390552 1.50255
C  -1.58037 1.764513 -0.339625
C  0.886518 -1.106297 -0.808663
C  -0.302828 2.52624 -0.57122
C  -2.507433 1.659288 -1.372166
C  -1.885066 1.185789 0.891461
C  -4.016128 0.434811 0.045896
C  -3.715154 1.006313 -1.187976
C  -3.086228 0.527049 1.07982
C  0.72888 -1.675202 0.445616
C  -0.126734 -1.165779 -1.754787
C  -0.471433 -2.30839 0.747222
C  -1.314887 -1.804251 -1.437729
C  -1.495275 -2.377797 -0.185356
C  -5.292426 -0.267955 0.305347
H  5.167686 2.020174 2.32782
H  4.633889 0.663723 3.306124
H  6.176278 0.578999 2.457463
H  4.615375 -2.775838 -1.182578
H  3.87844 -1.728195 -2.404178
H  5.574896 -1.511959 -1.973071
H  2.450198 1.576289 2.544018
H  -0.188871 2.732816 -1.635973
H  -0.339856 3.489454 -0.054041
H  -2.283361 2.091188 -2.339817
H  -1.193394 1.254969 1.719658
H  -4.406625 0.94759 -2.01701
H  -3.299298 0.088781 2.045492
H  1.516602 -1.642436 1.186893
H  0.013993 -0.713613 -2.728316
H  -0.597995 -2.750153 1.726806
H  -2.105166 -1.84716 -2.175538
H  -2.427046 -2.868647 0.061182
H  -6.919855 -0.765004 -0.522566
elementType: O N C H
totalener: -1238.78539931 hartree
nucrepener: 2474.52317914 hartree
electener: -3713.30857845 hartree
oneelecener: -6606.57469830 hartree
twoeener: 2893.26611985 hartree
cpcmener: -0.04399641 hartree
kineticenergy: 1233.60379879 hartree
xcener: -118.157087645986 hartree
chargesum: 0.0000000
charge: -0.330465 -0.225463 -0.291031 -0.480624 0.121711 -0.338472 -0.188420 -0.151662 0.253405 0.069771 -0.278413 -0.163200 0.016675 -0.001459 0.343370 0.130528 -0.177359 -0.179626 -0.022832 -0.158054 -0.158531 -0.200935 -0.265248 -0.159228 -0.117748 -0.197711 0.499707 0.114108 0.107666 0.098055 0.124428 0.116629 0.119520 0.134152 0.107492 0.109206 0.143244 0.146663 0.150119 0.140746 0.158473 0.144332 0.159545 0.161096 0.158328 0.257511
qa: -0.3305 -0.2255 -0.2910 -0.4806 0.1217 -0.3385 -0.1884 -0.1517 0.2534 0.0698 -0.2784 -0.1632 0.0167 -0.0015 0.3434 0.1305 -0.1774 -0.1796 -0.0228 -0.1581 -0.1585 -0.2009 -0.2652 -0.1592 -0.1177 -0.1977 0.4997 0.1141 0.1077 0.0981 0.1244 0.1166 0.1195 0.1342 0.1075 0.1092 0.1432 0.1467 0.1501 0.1407 0.1585 0.1443 0.1595 0.1611 0.1583 0.2575
va: 2.0683 1.9500 2.1949 2.0159 3.3273 2.9180 2.9148 3.5679 4.0885 3.9997 3.9566 3.8916 4.0244 3.6328 3.5503 3.7599 3.9305 3.8724 3.5106 3.9775 3.9841 3.8612 3.9576 3.8818 3.7977 3.8489 4.1993 0.9896 0.9915 1.0156 0.9882 1.0034 0.9990 1.0051 1.0033 1.0149 1.0026 1.0277 1.0148 1.0244 0.9981 1.0125 0.9904 0.9893 0.9920 0.9930
dispcorr: -0.027156443 hartree
energy: -1238.812555749789
dipole: 9.66087 -9.61316 0.04771 -1.50346 1.27923 -0.22423 0.40332 -1.78619 -1.38287
magnitude: 1.40174 au
magnitude: 3.56294 debye
