program: Orca
programVersion: 5.0.2
elementType: O O O O N N N C C C C C C C C C C C C C C C C C C C C H H H H H H H H H H H H H H H H H H H
charge: 0
multiplicity: 1
keywords: wb97x-d3
keywords: def2-TZVPP
keywords: def2/J RIJCOSX
keywords: DEFGRID2
keywords: scfconv7
keywords: smallprint printgap noloewdin
keywords: NOSOSCF
formula: C20H19N3O4
InChI: InChI=1/C20H19N3O4/c1-14-18(19(23(2)22-14)27-17-6-4-3-5-7-17)12-21-26-13-15-8-10-16(11-9-15)20(24)25/h3-12,24H,13H2,1-2H3
46 atoms
O  1.475434 -1.12006 -0.68909
O  0.558365 0.772692 1.123114
O  -6.478952 1.561631 -0.832606
O  -5.351916 1.054941 -2.689218
N  3.725688 -0.85898 -1.207738
N  4.678528 0.076973 -1.294094
N  0.873786 2.038096 0.704184
C  2.775688 0.995648 -0.497045
C  2.579954 -0.358914 -0.726561
C  4.123572 1.198233 -0.88846
C  4.880206 2.47702 -0.866651
C  4.00533 -2.23716 -1.537031
C  1.916475 2.062048 -0.029415
C  -1.871076 0.898615 0.94097
C  1.199372 -1.90274 0.41012
C  -0.661857 0.759756 1.8243
C  -3.086976 1.257936 1.517052
C  -1.825756 0.644921 -0.426718
C  -4.184192 1.119122 -0.620066
C  -4.234666 1.364547 0.752036
C  -2.96979 0.758219 -1.197973
C  -0.018639 -2.566143 0.380879
C  2.06075 -2.03318 1.48809
C  -0.37848 -3.368107 1.45318
C  1.68567 -2.843799 2.552185
C  0.469493 -3.511444 2.544227
C  -5.373668 1.237158 -1.49153
H  4.960705 2.877171 0.144709
H  5.887283 2.332989 -1.253653
H  4.391774 3.238335 -1.476864
H  4.837299 -2.261528 -2.234041
H  4.268966 -2.808464 -0.647567
H  3.141316 -2.694664 -2.012193
H  2.202928 3.067372 -0.318447
H  -0.67283 1.530751 2.601247
H  -0.689617 -0.208146 2.331854
H  -3.13658 1.463246 2.579662
H  -0.901085 0.359821 -0.909114
H  -5.159123 1.648723 1.235242
H  -2.909077 0.562079 -2.260094
H  -0.680357 -2.447783 -0.467845
H  3.00786 -1.510029 1.522544
H  -1.33073 -3.881517 1.433212
H  2.35639 -2.945963 3.395156
H  0.185038 -4.137761 3.378939
H  -7.225653 1.623735 -1.448376
elementType: O N C H
totalener: -1238.78675265 hartree
nucrepener: 2414.57375380 hartree
electener: -3653.36050644 hartree
oneelecener: -6486.11519159 hartree
twoeener: 2832.75468514 hartree
cpcmener: -0.04306157 hartree
kineticenergy: 1233.59240873 hartree
xcener: -118.151608144836 hartree
chargesum: 0.0000000
charge: -0.332366 -0.226188 -0.291473 -0.480001 0.154276 -0.343477 -0.199336 -0.083481 0.191351 0.059817 -0.280651 -0.166619 0.025630 0.074291 0.332732 0.095264 -0.195288 -0.228801 -0.048878 -0.151728 -0.140825 -0.289781 -0.208399 -0.115399 -0.154661 -0.189955 0.497153 0.114963 0.097892 0.108244 0.119732 0.122211 0.126718 0.135568 0.117364 0.118198 0.145327 0.149566 0.152842 0.141854 0.147900 0.157619 0.160226 0.162477 0.161004 0.257086
qa: -0.3324 -0.2262 -0.2915 -0.4800 0.1543 -0.3435 -0.1993 -0.0835 0.1914 0.0598 -0.2807 -0.1666 0.0256 0.0743 0.3327 0.0953 -0.1953 -0.2288 -0.0489 -0.1517 -0.1408 -0.2898 -0.2084 -0.1154 -0.1547 -0.1900 0.4972 0.1150 0.0979 0.1082 0.1197 0.1222 0.1267 0.1356 0.1174 0.1182 0.1453 0.1496 0.1528 0.1419 0.1479 0.1576 0.1602 0.1625 0.1610 0.2571
va: 2.0521 1.9356 2.1933 2.0175 3.3069 2.9261 2.9491 3.6028 4.1087 3.9854 3.9548 3.8829 4.0353 3.5470 3.5409 3.8243 4.0015 3.9517 3.5834 3.9994 4.0662 3.9611 3.8880 3.8763 3.9091 3.9070 4.2067 0.9892 1.0156 0.9912 1.0085 0.9859 0.9936 1.0038 1.0191 0.9872 1.0011 1.0132 1.0136 1.0234 1.0083 0.9947 0.9889 0.9890 0.9893 0.9933
dispcorr: -0.024782689 hartree
energy: -1238.811535335597
dipole: 11.71686 -11.48095 0.23591 -3.94346 2.98389 -0.95957 5.28611 -3.77822 1.50789
magnitude: 1.80283 au
magnitude: 4.58242 debye
