program: Orca
programVersion: 5.0.2
elementType: O O O O N N N C C C C C C C C C C C C C C C C C C C C H H H H H H H H H H H H H H H H H H H
charge: 0
multiplicity: 1
keywords: wb97x-d3
keywords: def2-TZVPP
keywords: def2/J RIJCOSX
keywords: DEFGRID2
keywords: scfconv7
keywords: smallprint printgap noloewdin
keywords: NOSOSCF
formula: C20H19N3O4
InChI: InChI=1/C20H19N3O4/c1-14-18(19(23(2)22-14)27-17-6-4-3-5-7-17)12-21-26-13-15-8-10-16(11-9-15)20(24)25/h3-12,24H,13H2,1-2H3
46 atoms
O  1.168924 -0.885061 0.209527
O  0.617796 1.773219 -0.362511
O  -4.657424 -0.912965 3.021464
O  -5.932399 -0.844567 1.192865
N  3.213109 -1.216025 1.183959
N  4.400305 -0.637937 1.408979
N  1.67348 2.453016 -0.897266
C  3.101374 0.73425 0.169165
C  2.404405 -0.433987 0.459481
C  4.35841 0.521287 0.791728
C  5.516145 1.452779 0.80486
C  2.897029 -2.516029 1.729889
C  2.793346 1.920883 -0.597193
C  -1.715191 1.556416 -0.139595
C  0.709662 -1.049595 -1.076819
C  -0.609302 2.277001 -0.850644
C  -2.891033 1.257735 -0.820748
C  -1.591804 1.172105 1.192984
C  -3.786863 0.177618 1.135374
C  -3.919161 0.579562 -0.192131
C  -2.614665 0.485115 1.824178
C  1.496111 -0.874426 -2.204809
C  -0.620082 -1.433083 -1.184379
C  0.925417 -1.070555 -3.456938
C  -1.170752 -1.6287 -2.44042
C  -0.403868 -1.444448 -3.584122
C  -4.899947 -0.568407 1.763312
H  5.258068 2.404465 1.270536
H  6.349132 1.022191 1.357479
H  5.862117 1.671812 -0.206524
H  2.480679 -3.164718 0.962795
H  3.81763 -2.9581 2.096118
H  2.190603 -2.437305 2.554558
H  3.641828 2.482226 -0.972397
H  -0.692972 2.118687 -1.930475
H  -0.679613 3.355401 -0.668117
H  -2.99667 1.540565 -1.860685
H  -0.693493 1.397282 1.751806
H  -4.820219 0.35234 -0.745627
H  -2.482242 0.192014 2.856298
H  2.538257 -0.593122 -2.131905
H  -1.217367 -1.575025 -0.292449
H  1.537022 -0.929403 -4.338281
H  -2.208004 -1.925969 -2.521542
H  -0.837921 -1.594575 -4.56338
H  -5.414342 -1.396835 3.386822
elementType: O N C H
totalener: -1238.78593831 hartree
nucrepener: 2464.37353491 hartree
electener: -3703.15947322 hartree
oneelecener: -6585.59853857 hartree
twoeener: 2882.43906535 hartree
cpcmener: -0.04214111 hartree
kineticenergy: 1233.60864732 hartree
xcener: -118.156863560456 hartree
chargesum: -0.0000000
charge: -0.333731 -0.218971 -0.290211 -0.479192 0.126163 -0.345536 -0.174392 -0.154417 0.283744 0.067418 -0.281288 -0.168933 0.008783 0.080943 0.340710 0.074755 -0.201528 -0.223281 -0.057633 -0.123950 -0.139255 -0.218690 -0.271457 -0.163171 -0.125231 -0.184069 0.496678 0.115000 0.097851 0.108097 0.121066 0.112127 0.126007 0.137707 0.109422 0.116790 0.143955 0.141855 0.144138 0.152961 0.160108 0.150160 0.161626 0.159738 0.160468 0.256669
qa: -0.3337 -0.2190 -0.2902 -0.4792 0.1262 -0.3455 -0.1744 -0.1544 0.2837 0.0674 -0.2813 -0.1689 0.0088 0.0809 0.3407 0.0748 -0.2015 -0.2233 -0.0576 -0.1239 -0.1393 -0.2187 -0.2715 -0.1632 -0.1252 -0.1841 0.4967 0.1150 0.0979 0.1081 0.1211 0.1121 0.1260 0.1377 0.1094 0.1168 0.1440 0.1419 0.1441 0.1530 0.1601 0.1502 0.1616 0.1597 0.1605 0.2567
va: 2.0666 1.9613 2.1942 2.0185 3.3199 2.9286 2.9530 3.6109 4.0296 3.9886 3.9550 3.8954 4.0305 3.5422 3.5832 3.8517 3.9519 3.9536 3.5870 3.9666 3.9913 3.8802 3.9634 3.9169 3.8566 3.9107 4.2046 0.9890 1.0155 0.9911 0.9920 1.0096 0.9860 1.0058 1.0016 1.0038 1.0045 1.0206 1.0191 1.0140 0.9986 1.0044 0.9893 0.9912 0.9888 0.9935
dispcorr: -0.026043713 hartree
energy: -1238.811982020728
dipole: 10.79916 -10.04060 0.75856 -0.42947 -0.05270 -0.48216 -3.89936 3.86435 -0.03501
magnitude: 0.89951 au
magnitude: 2.28638 debye
