program: Orca
programVersion: 5.0.2
elementType: O O O O N N N C C C C C C C C C C C C C C C C C C C C H H H H H H H H H H H H H H H H H H H
charge: 0
multiplicity: 1
keywords: wb97x-d3
keywords: def2-TZVPP
keywords: def2/J RIJCOSX
keywords: DEFGRID2
keywords: scfconv7
keywords: smallprint printgap noloewdin
keywords: NOSOSCF
formula: C20H19N3O4
InChI: InChI=1/C20H19N3O4/c1-14-18(19(23(2)22-14)27-17-6-4-3-5-7-17)12-21-26-13-15-8-10-16(11-9-15)20(24)25/h3-12,24H,13H2,1-2H3
46 atoms
O  1.145342 -0.323385 -0.822232
O  0.852706 1.291588 1.514319
O  -5.678078 -0.531637 -0.921462
O  -4.798031 0.718481 -2.544051
N  3.414813 -0.833236 -1.085442
N  4.624778 -0.287451 -0.901793
N  1.444937 2.476645 1.178317
C  3.034136 1.10899 -0.123514
C  2.440415 -0.037157 -0.620915
C  4.414522 0.886155 -0.34501
C  5.530546 1.802866 0.001065
C  3.270089 -2.140257 -1.683054
C  2.469638 2.320435 0.435587
C  -1.538883 1.185399 1.25503
C  0.527461 -1.318071 -0.093921
C  -0.385553 1.472878 2.175158
C  -1.582076 1.72152 -0.031169
C  -2.572263 0.354546 1.671125
C  -3.663325 0.58305 -0.461008
C  -2.631056 1.422569 -0.87918
C  -3.629873 0.05489 0.826845
C  1.048854 -1.827936 1.084978
C  -0.681332 -1.771075 -0.600699
C  0.331697 -2.802652 1.767204
C  -1.38804 -2.737357 0.097919
C  -0.886608 -3.257937 1.284245
C  -4.752303 0.279241 -1.416131
H  5.562308 2.004185 1.07249
H  6.487954 1.375315 -0.291415
H  5.421731 2.764538 -0.50328
H  4.17343 -2.358357 -2.244332
H  3.128418 -2.910256 -0.925435
H  2.425215 -2.152515 -2.367838
H  2.987372 3.249653 0.223125
H  -0.45058 2.487625 2.576747
H  -0.403888 0.782531 3.020689
H  -0.797924 2.379211 -0.382775
H  -2.546136 -0.080023 2.662679
H  -2.641948 1.844619 -1.874982
H  -4.410924 -0.602937 1.181738
H  1.989116 -1.473246 1.487248
H  -1.069903 -1.36195 -1.524536
H  0.733778 -3.200134 2.689799
H  -2.336443 -3.083589 -0.291173
H  -1.440227 -4.012047 1.826921
H  -6.365888 -0.693964 -1.585921
elementType: O N C H
totalener: -1238.78501748 hartree
nucrepener: 2493.36070865 hartree
electener: -3732.14572613 hartree
oneelecener: -6644.00636531 hartree
twoeener: 2911.86063918 hartree
cpcmener: -0.04253816 hartree
kineticenergy: 1233.60674385 hartree
xcener: -118.154458915898 hartree
chargesum: -0.0000000
charge: -0.319527 -0.228393 -0.291584 -0.479165 0.144473 -0.343699 -0.198995 -0.122881 0.222156 0.057109 -0.277308 -0.169289 0.020202 0.051856 0.347724 0.112960 -0.168600 -0.218512 -0.023144 -0.158265 -0.152403 -0.251899 -0.291410 -0.119223 -0.108085 -0.196957 0.498179 0.112139 0.097913 0.108266 0.118674 0.120990 0.129076 0.142127 0.109647 0.112585 0.146133 0.142226 0.141178 0.150219 0.151413 0.146334 0.162288 0.156553 0.159580 0.257335
qa: -0.3195 -0.2284 -0.2916 -0.4792 0.1445 -0.3437 -0.1990 -0.1229 0.2222 0.0571 -0.2773 -0.1693 0.0202 0.0519 0.3477 0.1130 -0.1686 -0.2185 -0.0231 -0.1583 -0.1524 -0.2519 -0.2914 -0.1192 -0.1081 -0.1970 0.4982 0.1121 0.0979 0.1083 0.1187 0.1210 0.1291 0.1421 0.1096 0.1126 0.1461 0.1422 0.1412 0.1502 0.1514 0.1463 0.1623 0.1566 0.1596 0.2573
va: 2.0546 1.9388 2.1932 2.0191 3.2972 2.9301 2.9135 3.6020 4.1023 4.0029 3.9556 3.8826 4.0002 3.5707 3.4654 3.7655 3.8993 3.9326 3.5264 4.0073 3.9521 3.8849 3.9482 3.8777 3.8154 3.8994 4.2033 0.9899 1.0151 0.9919 1.0105 0.9853 0.9908 1.0000 1.0229 0.9996 1.0128 1.0048 1.0236 1.0152 1.0085 1.0106 0.9871 0.9928 0.9897 0.9931
dispcorr: -0.027707300 hartree
energy: -1238.812724777534
dipole: 9.72634 -9.99572 -0.26938 -4.70327 3.28303 -1.42024 4.34853 -3.24431 1.10422
magnitude: 1.81905 au
magnitude: 4.62365 debye
