program: Orca
programVersion: 5.0.2
elementType: O O O O N N N C C C C C C C C C C C C C C C C C C C C H H H H H H H H H H H H H H H H H H H
charge: 0
multiplicity: 1
keywords: wb97x-d3
keywords: def2-TZVPP
keywords: def2/J RIJCOSX
keywords: DEFGRID2
keywords: scfconv7
keywords: smallprint printgap noloewdin
keywords: NOSOSCF
formula: C20H19N3O4
InChI: InChI=1/C20H19N3O4/c1-14-18(19(23(2)22-14)27-17-6-4-3-5-7-17)12-21-26-13-15-8-10-16(11-9-15)20(24)25/h3-12,24H,13H2,1-2H3
46 atoms
O  2.58122 -1.221492 -1.04043
O  0.501156 0.523045 -1.479804
O  -5.145886 1.104883 2.545916
O  -6.224872 2.198805 0.931846
N  4.100923 -0.677975 0.617271
N  4.517424 0.343066 1.373279
N  0.777804 1.81993 -1.148389
C  2.783324 1.003356 0.082558
C  3.066401 -0.33517 -0.160517
C  3.74699 1.361016 1.063222
C  3.92723 2.686699 1.712786
C  4.728343 -1.974969 0.710476
C  1.829006 1.954056 -0.445329
C  -1.90423 0.757292 -1.210517
C  1.549816 -2.053547 -0.680057
C  -0.751255 0.451269 -2.126295
C  -2.992599 1.488703 -1.67307
C  -1.9156 0.291072 0.101561
C  -4.083191 1.279589 0.463394
C  -4.075018 1.744959 -0.848671
C  -2.991015 0.549386 0.93251
C  1.020528 -2.831066 -1.700534
C  1.055386 -2.138864 0.612264
C  -0.026882 -3.694346 -1.42125
C  0.006763 -3.012086 0.874939
C  -0.542317 -3.787831 -0.13443
C  -5.258028 1.581439 1.313176
H  3.029212 2.99759 2.248476
H  4.747751 2.649029 2.427773
H  4.1555 3.465503 0.983303
H  5.669759 -1.853912 1.23778
H  4.102873 -2.67834 1.259889
H  4.931128 -2.375636 -0.280439
H  2.022231 2.991324 -0.19247
H  -0.824206 -0.577818 -2.486726
H  -0.772797 1.107326 -3.002181
H  -2.99383 1.868397 -2.687721
H  -1.081509 -0.284212 0.48328
H  -4.910114 2.318761 -1.22841
H  -2.968938 0.171946 1.945779
H  1.420868 -2.752203 -2.703681
H  1.45848 -1.533208 1.414395
H  -0.443241 -4.296018 -2.218969
H  -0.383037 -3.075502 1.882715
H  -1.36266 -4.460343 0.078054
H  -5.940053 1.321533 3.058171
elementType: O N C H
totalener: -1238.79169379 hartree
nucrepener: 2415.28208374 hartree
electener: -3654.07377752 hartree
oneelecener: -6487.31543391 hartree
twoeener: 2833.24165638 hartree
cpcmener: -0.03721774 hartree
kineticenergy: 1233.62417102 hartree
xcener: -118.154861731285 hartree
chargesum: -0.0000000
charge: -0.314563 -0.212319 -0.284797 -0.450394 0.148949 -0.340777 -0.188094 -0.089390 0.178277 0.071116 -0.283390 -0.169257 0.019309 0.044758 0.296805 0.075504 -0.174034 -0.216637 -0.044778 -0.126462 -0.166432 -0.278247 -0.158569 -0.115162 -0.202308 -0.158531 0.471315 0.113362 0.098998 0.106173 0.117047 0.120020 0.127801 0.127199 0.117513 0.111694 0.141400 0.172233 0.144351 0.146450 0.145281 0.156980 0.158354 0.158403 0.157843 0.247004
qa: -0.3146 -0.2123 -0.2848 -0.4504 0.1489 -0.3408 -0.1881 -0.0894 0.1783 0.0711 -0.2834 -0.1693 0.0193 0.0448 0.2968 0.0755 -0.1740 -0.2166 -0.0448 -0.1265 -0.1664 -0.2782 -0.1586 -0.1152 -0.2023 -0.1585 0.4713 0.1134 0.0990 0.1062 0.1170 0.1200 0.1278 0.1272 0.1175 0.1117 0.1414 0.1722 0.1444 0.1464 0.1453 0.1570 0.1584 0.1584 0.1578 0.2470
va: 2.0880 1.9399 2.1925 2.0534 3.2903 2.9287 2.9648 3.5656 4.1609 3.9574 3.9576 3.8869 4.0645 3.6104 3.5932 3.8100 3.9979 3.9036 3.5909 3.9815 4.0718 3.9576 3.8083 3.8796 3.9077 3.8733 4.2370 0.9898 1.0158 0.9906 1.0101 0.9860 0.9914 1.0050 0.9897 1.0179 1.0033 0.9995 1.0194 1.0215 1.0107 0.9959 0.9881 0.9915 0.9893 1.0020
dispcorr: -0.024567012 hartree
energy: -1238.816260798454
dipole: 9.22531 -8.25438 0.97094 -4.70127 3.04028 -1.66099 2.15358 -1.74427 0.40931
magnitude: 1.96701 au
magnitude: 4.99974 debye
