program: Orca
programVersion: 5.0.2
elementType: O O O O N N N C C C C C C C C C C C C C C C C C C C C H H H H H H H H H H H H H H H H H H H
charge: 0
multiplicity: 1
keywords: wb97x-d3
keywords: def2-TZVPP
keywords: def2/J RIJCOSX
keywords: DEFGRID2
keywords: scfconv7
keywords: smallprint printgap noloewdin
keywords: NOSOSCF
formula: C20H19N3O4
InChI: InChI=1/C20H19N3O4/c1-14-18(19(23(2)22-14)27-17-6-4-3-5-7-17)12-21-26-13-15-8-10-16(11-9-15)20(24)25/h3-12,24H,13H2,1-2H3
46 atoms
O  2.205387 -1.792006 -0.154566
O  0.084818 -0.132862 0.586525
O  -6.631867 2.250649 -1.110963
O  -5.443187 2.365617 -2.993257
N  3.711809 -0.714304 -1.493455
N  4.14173 0.499288 -1.864247
N  0.500744 1.083182 1.052087
C  2.539034 0.703036 -0.285565
C  2.74971 -0.642383 -0.564994
C  3.468117 1.358202 -1.135117
C  3.68069 2.824153 -1.264809
C  4.203015 -1.904482 -2.145032
C  1.649861 1.40715 0.612985
C  -2.296445 0.289321 0.336015
C  2.020869 -2.07744 1.17508
C  -1.201366 -0.431215 1.072585
C  -3.504512 0.540296 0.977818
C  -2.153813 0.654812 -1.000023
C  -4.422572 1.471847 -1.041723
C  -4.562045 1.12246 0.30027
C  -3.2063 1.239942 -1.680802
C  1.133137 -3.110829 1.443969
C  2.688932 -1.425844 2.199559
C  0.893688 -3.476343 2.758174
C  2.433907 -1.803489 3.512533
C  1.536045 -2.819968 3.800929
C  -5.527467 2.072139 -1.823646
H  3.998169 3.270003 -0.320546
H  4.44776 3.034363 -2.008714
H  2.766278 3.334368 -1.571187
H  4.417324 -2.68287 -1.416206
H  3.482215 -2.28291 -2.869747
H  5.122584 -1.648359 -2.662378
H  1.976523 2.38443 0.953176
H  -1.265382 -0.239559 2.147704
H  -1.320274 -1.508252 0.929292
H  -3.622849 0.276146 2.021983
H  -1.221477 0.478492 -1.521098
H  -5.488592 1.299789 0.828839
H  -3.080519 1.511039 -2.72082
H  0.627899 -3.613891 0.628763
H  3.400316 -0.635942 1.996358
H  0.194855 -4.276346 2.966227
H  2.949836 -1.291887 4.314757
H  1.340999 -3.102078 4.827136
H  -7.328603 2.634825 -1.664882
elementType: O N C H
totalener: -1238.79225738 hartree
nucrepener: 2372.18520801 hartree
electener: -3610.97746539 hartree
oneelecener: -6401.31244523 hartree
twoeener: 2790.33497984 hartree
cpcmener: -0.03729695 hartree
kineticenergy: 1233.62901314 hartree
xcener: -118.157040478849 hartree
chargesum: -0.0000000
charge: -0.328263 -0.221230 -0.286247 -0.450578 0.112647 -0.338174 -0.161326 -0.151574 0.288055 0.065843 -0.280849 -0.167272 -0.015668 0.032681 0.382463 0.132619 -0.185184 -0.202843 -0.057211 -0.152967 -0.132047 -0.332016 -0.230252 -0.081305 -0.131312 -0.205531 0.474711 0.106384 0.098610 0.113155 0.117324 0.122819 0.113047 0.136177 0.103805 0.111794 0.141621 0.142004 0.150642 0.144116 0.146350 0.154360 0.157783 0.158289 0.156704 0.247847
qa: -0.3283 -0.2212 -0.2862 -0.4506 0.1126 -0.3382 -0.1613 -0.1516 0.2881 0.0658 -0.2808 -0.1673 -0.0157 0.0327 0.3825 0.1326 -0.1852 -0.2028 -0.0572 -0.1530 -0.1320 -0.3320 -0.2303 -0.0813 -0.1313 -0.2055 0.4747 0.1064 0.0986 0.1132 0.1173 0.1228 0.1130 0.1362 0.1038 0.1118 0.1416 0.1420 0.1506 0.1441 0.1464 0.1544 0.1578 0.1583 0.1567 0.2478
va: 2.0899 1.9637 2.1913 2.0532 3.3130 2.9293 2.9357 3.5885 4.0439 3.9880 3.9535 3.8962 4.0403 3.6885 3.5427 3.7671 3.9813 3.9897 3.5937 4.0115 4.0074 3.9761 3.8899 3.8396 3.8975 3.9282 4.2364 0.9918 1.0154 0.9892 0.9945 0.9863 1.0088 1.0041 1.0187 0.9939 1.0041 1.0171 1.0152 1.0205 1.0106 1.0017 0.9881 0.9899 0.9910 1.0013
dispcorr: -0.022940852 hartree
energy: -1238.815198230649
dipole: 10.71858 -10.42590 0.29268 -3.02040 1.79164 -1.22875 4.44676 -2.94737 1.49940
magnitude: 1.96053 au
magnitude: 4.98327 debye
