program: Orca
programVersion: 5.0.2
elementType: O O O O N N N C C C C C C C C C C C C C C C C C C C C H H H H H H H H H H H H H H H H H H H
charge: 0
multiplicity: 1
keywords: wb97x-d3
keywords: def2-TZVPP
keywords: def2/J RIJCOSX
keywords: DEFGRID2
keywords: scfconv7
keywords: smallprint printgap noloewdin
keywords: NOSOSCF
formula: C20H19N3O4
InChI: InChI=1/C20H19N3O4/c1-14-18(19(23(2)22-14)27-17-6-4-3-5-7-17)12-21-26-13-15-8-10-16(11-9-15)20(24)25/h3-12,24H,13H2,1-2H3
46 atoms
O  1.442897 -0.984446 0.521158
O  0.53769 1.041622 -1.166492
O  -6.357431 0.881597 1.389312
O  -5.022514 0.48683 3.129194
N  3.737648 -0.905071 0.861054
N  4.763796 -0.048997 0.885924
N  0.955691 2.255292 -0.694011
C  2.879215 1.0368 0.280889
C  2.597506 -0.304536 0.49466
C  4.269089 1.122359 0.552865
C  5.127983 2.333875 0.475452
C  3.92076 -2.294698 1.205161
C  2.054314 2.179536 -0.056755
C  -1.868021 1.068331 -0.7504
C  1.037208 -1.71278 -0.571621
C  -0.739942 1.1334 -1.744537
C  -1.666571 0.826208 0.60433
C  -3.172102 1.213663 -1.220153
C  -4.04809 0.856361 0.992326
C  -2.746454 0.721942 1.465471
C  -4.252899 1.10812 -0.364998
C  -0.20232 -2.325922 -0.455642
C  1.794252 -1.845334 -1.725451
C  -0.690132 -3.076012 -1.514343
C  1.292154 -2.604545 -2.774821
C  0.053164 -3.220896 -2.678896
C  -5.166138 0.722038 1.952126
H  4.77386 3.119898 1.144871
H  6.153212 2.094755 0.753905
H  5.141977 2.751168 -0.532526
H  4.859786 -2.387466 1.742283
H  3.114606 -2.637281 1.850551
H  3.957788 -2.923552 0.31597
H  2.421493 3.148015 0.26692
H  -0.814284 0.283044 -2.427612
H  -0.823155 2.040413 -2.352607
H  -0.670149 0.708291 1.005966
H  -3.344684 1.406425 -2.272892
H  -2.567971 0.530133 2.515541
H  -5.25144 1.220989 -0.764884
H  -0.78128 -2.209271 0.45208
H  2.757593 -1.361501 -1.828958
H  -1.659398 -3.549471 -1.425064
H  1.881892 -2.707506 -3.676673
H  -0.329739 -3.808238 -3.503074
H  -7.054267 0.778969 2.055202
elementType: O N C H
totalener: -1238.79211615 hartree
nucrepener: 2428.20079451 hartree
electener: -3666.99291065 hartree
oneelecener: -6513.20055884 hartree
twoeener: 2846.20764819 hartree
cpcmener: -0.03585555 hartree
kineticenergy: 1233.61476470 hartree
xcener: -118.154419815337 hartree
chargesum: 0.0000000
charge: -0.323333 -0.222842 -0.286487 -0.451599 0.157568 -0.341522 -0.188885 -0.079687 0.188206 0.059068 -0.280701 -0.166160 0.017773 0.054068 0.322622 0.101310 -0.213807 -0.190727 -0.039025 -0.143988 -0.156121 -0.285486 -0.200879 -0.113354 -0.154092 -0.184905 0.476493 0.106296 0.098409 0.112924 0.118228 0.126375 0.119117 0.132264 0.119303 0.118204 0.144361 0.142483 0.140850 0.149387 0.143976 0.153660 0.157407 0.158393 0.157677 0.247183
qa: -0.3233 -0.2228 -0.2865 -0.4516 0.1576 -0.3415 -0.1889 -0.0797 0.1882 0.0591 -0.2807 -0.1662 0.0178 0.0541 0.3226 0.1013 -0.2138 -0.1907 -0.0390 -0.1440 -0.1561 -0.2855 -0.2009 -0.1134 -0.1541 -0.1849 0.4765 0.1063 0.0984 0.1129 0.1182 0.1264 0.1191 0.1323 0.1193 0.1182 0.1444 0.1425 0.1408 0.1494 0.1440 0.1537 0.1574 0.1584 0.1577 0.2472
va: 2.0651 1.9496 2.1908 2.0527 3.2988 2.9288 2.9495 3.6083 4.1072 3.9806 3.9525 3.8828 4.0357 3.5544 3.5644 3.8353 3.9282 4.0061 3.5688 4.0636 4.0069 3.9626 3.8794 3.8820 3.9111 3.9096 4.2347 0.9918 1.0156 0.9895 1.0099 0.9929 0.9867 1.0045 0.9866 1.0205 1.0149 1.0009 1.0239 1.0154 1.0106 0.9977 0.9895 0.9903 0.9902 1.0019
dispcorr: -0.025158022 hartree
energy: -1238.817274168974
dipole: 10.96979 -10.93443 0.03536 -3.29296 2.46730 -0.82566 -6.20023 4.78453 -1.41570
magnitude: 1.63926 au
magnitude: 4.16667 debye
