program: Orca
programVersion: 5.0.2
elementType: O O O O N N N C C C C C C C C C C C C C C C C C C C C H H H H H H H H H H H H H H H H H H H
charge: 0
multiplicity: 1
keywords: wb97x-d3
keywords: def2-TZVPP
keywords: def2/J RIJCOSX
keywords: DEFGRID2
keywords: scfconv7
keywords: smallprint printgap noloewdin
keywords: NOSOSCF
formula: C20H19N3O4
InChI: InChI=1/C20H19N3O4/c1-14-18(19(23(2)22-14)27-17-6-4-3-5-7-17)12-21-26-13-15-8-10-16(11-9-15)20(24)25/h3-12,24H,13H2,1-2H3
46 atoms
O  1.471878 -0.875725 -0.827336
O  0.586659 0.711264 1.272971
O  -6.459508 1.257561 -0.797042
O  -5.237261 1.353458 -2.658172
N  3.765708 -0.71783 -1.153893
N  4.787461 0.132235 -1.005977
N  0.986792 2.003996 1.074116
C  2.902773 1.052043 -0.169841
C  2.625932 -0.215822 -0.660268
C  4.288318 1.205092 -0.43302
C  5.141024 2.382581 -0.122167
C  3.959053 -2.012952 -1.760898
C  2.073669 2.084831 0.417219
C  -1.841485 0.858655 1.024689
C  1.065159 -1.822536 0.081525
C  -0.655048 0.658006 1.928537
C  -1.729823 0.968065 -0.357218
C  -3.110764 0.893848 1.599642
C  -4.129894 1.127546 -0.567355
C  -2.863239 1.103291 -1.142747
C  -4.244685 1.022026 0.819246
C  1.830989 -2.216073 1.168193
C  -0.184214 -2.379261 -0.151826
C  1.327198 -3.18157 2.030322
C  -0.673114 -3.33894 0.720912
C  0.078183 -3.745783 1.816009
C  -5.307325 1.258532 -1.454828
H  4.768584 3.286193 -0.607816
H  5.175047 2.582707 0.949735
H  6.160894 2.215115 -0.465352
H  3.13747 -2.243537 -2.43587
H  4.881566 -1.984201 -2.332855
H  4.032292 -2.796762 -1.007167
H  2.424255 3.1058 0.306564
H  -0.685727 1.376346 2.754927
H  -0.70668 -0.340457 2.370813
H  -0.764458 0.944139 -0.843158
H  -3.21431 0.814765 2.67574
H  -2.753547 1.18768 -2.215996
H  -5.212805 1.039049 1.301045
H  2.802567 -1.779513 1.363502
H  -0.770199 -2.057672 -1.003795
H  1.923471 -3.48884 2.879844
H  -1.649753 -3.769337 0.540456
H  -0.306589 -4.495132 2.494978
H  -7.196739 1.341335 -1.421072
elementType: O N C H
totalener: -1238.79234743 hartree
nucrepener: 2423.06439928 hartree
electener: -3661.85674671 hartree
oneelecener: -6502.93995261 hartree
twoeener: 2841.08320591 hartree
cpcmener: -0.03605692 hartree
kineticenergy: 1233.61029243 hartree
xcener: -118.153567141103 hartree
chargesum: -0.0000000
charge: -0.322441 -0.220820 -0.286382 -0.451547 0.155723 -0.341003 -0.191015 -0.079853 0.185744 0.058751 -0.280757 -0.166806 0.019050 0.051896 0.327752 0.100224 -0.207928 -0.190929 -0.040895 -0.142127 -0.156490 -0.202863 -0.286774 -0.154498 -0.113832 -0.184387 0.476238 0.106138 0.113160 0.098869 0.126684 0.118294 0.119272 0.133306 0.119059 0.118813 0.140545 0.142908 0.141344 0.149066 0.154573 0.143374 0.158420 0.157403 0.156991 0.247751
qa: -0.3224 -0.2208 -0.2864 -0.4515 0.1557 -0.3410 -0.1910 -0.0799 0.1857 0.0588 -0.2808 -0.1668 0.0191 0.0519 0.3278 0.1002 -0.2079 -0.1909 -0.0409 -0.1421 -0.1565 -0.2029 -0.2868 -0.1545 -0.1138 -0.1844 0.4762 0.1061 0.1132 0.0989 0.1267 0.1183 0.1193 0.1333 0.1191 0.1188 0.1405 0.1429 0.1413 0.1491 0.1546 0.1434 0.1584 0.1574 0.1570 0.2478
va: 2.0672 1.9490 2.1914 2.0527 3.2970 2.9268 2.9487 3.6058 4.1135 3.9831 3.9515 3.8836 4.0337 3.5572 3.5592 3.8366 3.9323 4.0032 3.5695 4.0622 4.0075 3.8778 3.9647 3.9127 3.8805 3.9082 4.2353 0.9920 0.9895 1.0156 0.9928 1.0096 0.9862 1.0041 1.0193 0.9862 1.0160 1.0009 1.0235 1.0154 0.9968 1.0109 0.9905 0.9894 0.9905 1.0014
dispcorr: -0.025027133 hartree
energy: -1238.817374559543
dipole: 11.29861 -11.18257 0.11604 -4.81700 3.63264 -1.18436 4.95182 -3.72843 1.22340
magnitude: 1.70672 au
magnitude: 4.33813 debye
