program: Orca
programVersion: 5.0.2
elementType: O O O O N N N C C C C C C C C C C C C C C C C C C C C H H H H H H H H H H H H H H H H H H H
charge: 0
multiplicity: 1
keywords: wb97x-d3
keywords: def2-TZVPP
keywords: def2/J RIJCOSX
keywords: DEFGRID2
keywords: scfconv7
keywords: smallprint printgap noloewdin
keywords: NOSOSCF
formula: C20H19N3O4
InChI: InChI=1/C20H19N3O4/c1-14-18(19(23(2)22-14)27-17-6-4-3-5-7-17)12-21-26-13-15-8-10-16(11-9-15)20(24)25/h3-12,24H,13H2,1-2H3
46 atoms
O  1.232937 -0.65817 0.423689
O  0.686426 2.025555 0.219306
O  -4.783545 -1.577844 2.266966
O  -5.643387 -1.223374 0.241546
N  3.432917 -1.311921 0.524712
N  4.685751 -0.848647 0.497654
N  1.744781 2.836426 -0.06247
C  3.231459 0.854383 0.18877
C  2.531605 -0.337011 0.351066
C  4.588702 0.444288 0.289447
C  5.80274 1.298448 0.196259
C  3.162406 -2.709961 0.765087
C  2.863787 2.230932 -0.058266
C  -1.639799 1.814415 0.442707
C  0.504991 -0.885461 -0.720593
C  -0.51783 2.776909 0.196786
C  -2.610302 1.592469 -0.526785
C  -1.708684 1.109008 1.642227
C  -3.704025 -0.012882 0.894788
C  -3.637462 0.690841 -0.30379
C  -2.729449 0.203611 1.869753
C  -0.66902 -1.60511 -0.550146
C  0.886882 -0.427045 -1.971912
C  -1.476176 -1.857208 -1.648085
C  0.069543 -0.695396 -3.062972
C  -1.112392 -1.404481 -2.909777
C  -4.807938 -0.984249 1.08156
H  6.698879 0.695419 0.334699
H  5.877574 1.790272 -0.774944
H  5.804204 2.08017 0.95715
H  4.113591 -3.232958 0.77847
H  2.666267 -2.855186 1.72368
H  2.543455 -3.129991 -0.025984
H  3.690955 2.8969 -0.27987
H  -0.64309 3.276227 -0.768184
H  -0.495144 3.548887 0.973697
H  -2.563929 2.126625 -1.467676
H  -0.962264 1.26998 2.410418
H  -4.382766 0.532126 -1.071727
H  -2.755331 -0.33065 2.809522
H  -0.945921 -1.96299 0.433194
H  1.80191 0.133664 -2.112485
H  -2.393934 -2.415267 -1.514108
H  0.365493 -0.337521 -4.040706
H  -1.743878 -1.604516 -3.765263
H  -5.515998 -2.209133 2.33784
elementType: O N C H
totalener: -1238.79093346 hartree
nucrepener: 2479.73952752 hartree
electener: -3718.53046098 hartree
oneelecener: -6616.57944953 hartree
twoeener: 2898.04898855 hartree
cpcmener: -0.03656315 hartree
kineticenergy: 1233.62358740 hartree
xcener: -118.154047370820 hartree
chargesum: 0.0000000
charge: -0.317879 -0.206542 -0.284686 -0.449882 0.140891 -0.342682 -0.169379 -0.146744 0.241195 0.079604 -0.279932 -0.166863 0.010210 -0.034665 0.296017 0.086674 -0.107669 -0.153851 -0.001137 -0.177570 -0.187431 -0.242000 -0.213935 -0.123657 -0.143268 -0.181882 0.481054 0.099124 0.106720 0.111457 0.114428 0.124679 0.119442 0.128250 0.093701 0.110305 0.142664 0.143250 0.140514 0.147825 0.144743 0.154238 0.152586 0.157771 0.156717 0.247599
qa: -0.3179 -0.2065 -0.2847 -0.4499 0.1409 -0.3427 -0.1694 -0.1467 0.2412 0.0796 -0.2799 -0.1669 0.0102 -0.0347 0.2960 0.0867 -0.1077 -0.1539 -0.0011 -0.1776 -0.1874 -0.2420 -0.2139 -0.1237 -0.1433 -0.1819 0.4811 0.0991 0.1067 0.1115 0.1144 0.1247 0.1194 0.1282 0.0937 0.1103 0.1427 0.1433 0.1405 0.1478 0.1447 0.1542 0.1526 0.1578 0.1567 0.2476
va: 2.0529 1.9760 2.1947 2.0520 3.3094 2.9338 2.9812 3.5762 4.1178 3.9549 3.9543 3.8961 4.0589 3.7194 3.5901 3.8499 3.8484 3.8826 3.4933 3.9792 3.9815 3.9216 3.9193 3.8383 3.9123 3.8963 4.2218 1.0159 0.9904 0.9895 1.0107 0.9885 0.9903 1.0080 1.0085 0.9991 1.0021 1.0082 1.0229 1.0166 1.0109 1.0014 0.9949 0.9899 0.9906 1.0016
dispcorr: -0.026675713 hartree
energy: -1238.817609170477
dipole: 10.31867 -9.94408 0.37458 -0.34927 -0.22487 -0.57414 -3.54275 3.86183 0.31908
magnitude: 0.75615 au
magnitude: 1.92199 debye
