program: Orca
programVersion: 5.0.2
elementType: O O O O N N N C C C C C C C C C C C C C C C C C C C C H H H H H H H H H H H H H H H H H H H
charge: 0
multiplicity: 1
keywords: wb97x-d3
keywords: def2-TZVPP
keywords: def2/J RIJCOSX
keywords: DEFGRID2
keywords: scfconv7
keywords: smallprint printgap noloewdin
keywords: NOSOSCF
formula: C20H19N3O4
InChI: InChI=1/C20H19N3O4/c1-14-18(19(23(2)22-14)27-17-6-4-3-5-7-17)12-21-26-13-15-8-10-16(11-9-15)20(24)25/h3-12,24H,13H2,1-2H3
46 atoms
O  1.317802 -0.013779 -1.044654
O  0.765655 2.043859 0.724557
O  -5.069571 -1.606117 0.411578
O  -5.257257 -0.599609 -1.567866
N  3.411105 -1.02139 -0.85725
N  4.634894 -0.802272 -0.360507
N  1.867827 2.808806 0.970025
C  3.287444 0.943162 0.130444
C  2.571377 -0.014239 -0.573766
C  4.586659 0.374998 0.218242
C  5.786441 0.960859 0.872439
C  3.123782 -2.240221 -1.574711
C  2.969334 2.244445 0.676534
C  -1.57373 1.902522 0.761459
C  0.424572 -0.94164 -0.557417
C  -0.397657 2.746616 1.145167
C  -2.182569 2.057986 -0.479717
C  -2.034028 0.910261 1.620161
C  -3.677733 0.234993 0.000265
C  -3.227014 1.23348 -0.858781
C  -3.079528 0.082788 1.249015
C  -0.647172 -1.253935 -1.380253
C  0.572193 -1.54123 0.684573
C  -1.57434 -2.192908 -0.956856
C  -0.361092 -2.487301 1.088101
C  -1.432698 -2.820709 0.273319
C  -4.744804 -0.675915 -0.475816
H  5.611078 1.162672 1.92994
H  6.630265 0.276809 0.795792
H  6.076705 1.90405 0.406377
H  2.692998 -2.996669 -0.918887
H  2.437622 -2.047338 -2.395801
H  4.055826 -2.617203 -1.985385
H  3.823816 2.873026 0.904028
H  -0.44651 3.724453 0.657712
H  -0.373403 2.907788 2.22739
H  -1.834036 2.826921 -1.158308
H  -1.568582 0.779473 2.589437
H  -3.68157 1.360661 -1.832106
H  -3.407946 -0.685215 1.93501
H  -0.750539 -0.769243 -2.342756
H  1.397428 -1.286381 1.337795
H  -2.409735 -2.436937 -1.600708
H  -0.245102 -2.960586 2.054538
H  -2.156633 -3.556833 0.596559
H  -5.760908 -2.182624 0.051121
elementType: O N C H
totalener: -1238.79075003 hartree
nucrepener: 2503.66770911 hartree
electener: -3742.45845914 hartree
oneelecener: -6664.49030660 hartree
twoeener: 2922.03184746 hartree
cpcmener: -0.03712348 hartree
kineticenergy: 1233.64295284 hartree
xcener: -118.158917898626 hartree
chargesum: 0.0000000
charge: -0.297568 -0.207436 -0.283592 -0.447056 0.145387 -0.337217 -0.176926 -0.130189 0.204651 0.071637 -0.281735 -0.169026 0.018515 -0.038688 0.253766 0.089822 -0.113064 -0.171869 -0.023840 -0.163044 -0.146847 -0.268549 -0.197805 -0.072327 -0.122371 -0.201398 0.478414 0.113039 0.098818 0.105834 0.121113 0.127099 0.120150 0.127381 0.094991 0.096841 0.143527 0.144177 0.138929 0.147415 0.142338 0.153010 0.156878 0.157197 0.151652 0.247965
qa: -0.2976 -0.2074 -0.2836 -0.4471 0.1454 -0.3372 -0.1769 -0.1302 0.2047 0.0716 -0.2817 -0.1690 0.0185 -0.0387 0.2538 0.0898 -0.1131 -0.1719 -0.0238 -0.1630 -0.1468 -0.2685 -0.1978 -0.0723 -0.1224 -0.2014 0.4784 0.1130 0.0988 0.1058 0.1211 0.1271 0.1202 0.1274 0.0950 0.0968 0.1435 0.1442 0.1389 0.1474 0.1423 0.1530 0.1569 0.1572 0.1517 0.2480
va: 2.0739 1.9665 2.1916 2.0547 3.2963 2.9271 2.9751 3.5628 4.1616 3.9688 3.9544 3.8855 4.0560 3.7297 3.5781 3.8783 3.8860 3.8803 3.4898 3.9917 3.9184 3.9420 3.8618 3.7777 3.8578 3.8714 4.2188 0.9897 1.0159 0.9908 0.9844 0.9909 1.0109 1.0068 1.0030 0.9998 1.0002 1.0029 1.0227 1.0170 1.0152 1.0022 0.9924 0.9895 0.9977 1.0014
dispcorr: -0.028157998 hartree
energy: -1238.818908030427
dipole: 9.50718 -9.55464 -0.04747 -3.56457 2.42959 -1.13498 3.09824 -2.37085 0.72739
magnitude: 1.34890 au
magnitude: 3.42863 debye
