program: Gaussian 09
title: 000054742
version: EM64L-G09RevD.01
frameworkgroup: C1[X(C15H17N5S)]
method: RPBEPBE
basis: SDD
operation: Freq
keyword: #p
keyword: freq=noraman
keyword: PBEPBE/SDD
title: #p freq=noraman PBEPBE/SDD
converged: YES YES NO NO
title: Mulliken charges:
elementType: S N N N N N C C C C C C C C C C C C C C C H H H H H H H H H H H H H H H H H
charge: 0.315451 -0.158335 -0.063172 -0.198797 -0.080650 -0.010693 -0.361823 -0.385710 -0.371762 -0.368459 0.217200 -0.613756 -0.238250 0.345014 -0.197857 -0.371241 -0.334837 -0.355516 -0.229908 -0.213026 -0.246142 0.229477 0.251317 0.243813 0.243550 0.186285 0.219992 0.220583 0.183476 0.190385 0.226245 0.227330 0.276761 0.257893 0.249094 0.253811 0.229711 0.232548
chargesum: 0.00000
title: Mulliken charges with hydrogens summed into heavy atoms:
elementType: S N N N N N C C C C C C C C C C C C C C C
charge: 0.315451 -0.158335 -0.063172 -0.198797 -0.080650 -0.010693 0.118971 0.101653 0.034515 0.035600 0.217200 0.030205 -0.238250 0.345014 0.078903 -0.371241 -0.076944 -0.106422 0.023903 0.016685 -0.013594
polarizability: 3.00527716e+02 2.25397875e+01 2.18008064e+02 2.91089379e+00 -7.22974191e+00 1.39517887e+02
1716.lowfreq: -7.0842 0.0011 0.0019 0.0024 5.4671 10.2758 35.5628 46.0948 61.0820
frequency: 35.5163 46.0797 61.0175 78.7221 88.0259 139.3680 161.4178 170.1288 199.6070 211.2523 229.8782 263.2091 276.6335 300.8739 309.2582 321.0242 348.7409 355.7467 383.6862 401.8257 437.5104 449.9455 472.3173 496.1414 508.4745 536.7147 578.9515 604.3200 633.5636 646.2400 663.8387 675.1737 690.8342 731.3164 744.3088 748.8016 763.4016 820.1956 838.7532 849.8573 864.5657 869.4346 883.9322 939.3466 947.0549 981.7878 1000.8572 1011.7583 1018.5823 1036.6992 1048.2080 1055.6636 1063.5737 1070.9646 1079.5479 1115.8936 1125.5716 1135.5973 1150.3653 1151.3633 1166.3961 1171.0257 1196.5310 1223.4760 1233.6918 1249.8228 1255.9709 1270.1261 1284.2653 1294.5469 1329.4967 1333.4104 1351.9413 1353.6804 1363.1673 1374.2445 1390.3389 1406.8940 1428.3520 1433.5803 1453.1633 1453.9250 1459.9341 1461.1842 1468.3831 1472.5631 1474.5471 1481.5520 1557.2500 1590.3344 1638.4376 2832.7767 2848.2778 2868.6333 2966.9730 2977.9852 3023.0355 3034.3390 3038.1927 3080.6898 3099.2552 3100.5367 3132.2406 3145.6458 3158.7706 3171.1198 3227.5707 3256.3622
redmass: 4.3796 4.1352 4.1167 5.1518 4.5160 4.3641 4.5696 3.3424 4.7636 1.8889 1.5521 4.7181 5.3930 2.6758 5.8720 2.2072 3.7153 6.3419 4.1444 2.3042 4.4141 6.2419 2.7614 5.2327 5.9010 4.1748 4.1716 3.6660 4.0880 4.8196 7.2403 5.1182 5.8799 3.3017 2.7471 1.4474 1.3585 4.9311 1.5810 1.3751 2.4699 2.0307 6.9155 2.0828 1.3803 1.3240 2.6084 2.7002 6.1761 2.1291 1.6707 1.7627 2.5621 1.7136 1.7693 1.6822 1.5610 2.3868 2.8327 3.1146 1.2045 2.1259 1.0866 2.7002 2.4519 1.9980 2.2642 2.3782 1.6340 1.5026 2.3798 1.4587 2.6867 2.0303 1.4219 1.4875 4.3471 3.0006 2.5867 1.1685 1.1205 2.1704 1.1581 1.1588 1.1015 3.4676 1.1457 1.0532 6.1923 6.7028 10.4925 1.0707 1.0680 1.0584 1.0691 1.0684 1.0735 1.0876 1.0899 1.1010 1.0926 1.0938 1.0854 1.0896 1.0947 1.1008 1.0912 1.1084
irintensity: 0.1821 0.5036 0.3623 0.2803 2.6161 1.4473 7.0158 4.4613 0.5738 1.6636 1.0123 1.6055 2.2361 8.2369 2.4849 11.2047 2.9033 3.2970 4.9428 3.5351 5.8409 3.2863 0.4237 4.4472 4.8518 1.2223 1.1440 2.0291 4.1816 7.4165 3.3939 11.6836 5.4896 4.0053 5.0253 56.8883 88.3884 10.2649 0.5008 4.4388 3.6466 3.6192 0.0973 2.0658 1.8680 0.0899 124.4277 1.6323 13.3207 3.2094 5.1484 23.1483 17.7730 11.4413 1.2680 7.1371 29.5240 5.3820 19.1891 80.3219 2.9840 17.3635 1.4909 3.3821 24.3144 4.5683 241.1387 8.9322 43.2343 28.3875 28.4756 3.6378 4.1837 0.9624 26.3522 0.0314 158.6165 126.8506 16.4226 4.0239 1.4300 4.0504 6.5355 34.5708 37.8899 2.8254 13.5922 9.0925 1.5832 122.1781 721.8727 65.3386 59.5679 198.2677 40.5653 43.2706 48.2485 41.5855 50.5410 29.1127 11.2279 6.1608 3.5255 6.9112 16.5599 26.7555 3.2554 2.4854
temp: 298.150 k
press: 1.00000 atm
elementType: 16 7 7 7 7 7 6 6 6 6 6 6 6 6 6 6 6 6 6 6 6 1 1 1 1 1 1 1 1 1 1 1 1 1 1 1 1 1
symmnumber: 1
zpe: 791976.2 jmol-1
zpe.correction: 0.301648 hartree
zpe.thermalcorrener: 0.319518 hartree
zpe.thermalcorrenthalpy: 0.320463 hartree
zpe.thermalcorrgfe: 0.255715 hartree
zpe.sumelectzpe: -1252.051132 hartree
zpe.sumelectthermal: -1252.033261 hartree
zpe.sumelectthermalent: -1252.032317 hartree
zpe.sumelectthermalfe: -1252.097065 hartree
dipole: 4.6933 -2.2950 1.9688
dipole: 5.5830
quadrupole: -113.4883 -133.8501 -132.3059
quadrupole: 9.5304 1.9644 -1.8881
quadrupole: 13.0598 -7.3020 -5.7578 9.5304 1.9644 -1.8881
hfenergy: -1252.3527797 hartree
pointgroup: C01 [X(C15H17N5S1)]
dipole: 1.779195 -0.914396 0.9072106 debye
polarizability: 302.4371099|18.8313081|213.8676148|4.4500312|-14.1079291|141.7489426 unknown
InChI: InChI=1S/C15H17N5S/c1-18-8-10-19(11-9-18)14-17-12-4-2-3-5-13(12)21-15-16-6-7-20(14)15/h2-7H,8-11H2,1H3
charge 0 multiplicity 1
38 atoms
S  -2.133544 1.224165 -1.686279
N  1.6721 -0.35715 -0.198284
N  4.49617 -0.895179 -0.199945
N  -0.036282 1.259652 0.175192
N  -0.552074 -1.106821 -0.141375
N  -1.150566 3.239122 0.049662
C  2.161039 -1.753856 -0.234925
C  2.622158 0.604207 -0.813197
C  3.543299 -1.834191 0.436656
C  3.994584 0.494966 -0.127459
C  0.305414 -0.120236 -0.093751
C  5.868215 -1.032431 0.323908
C  -1.079037 1.991236 -0.431559
C  -1.94663 -1.062306 0.026873
C  0.566164 2.124591 1.113721
C  -2.817329 -0.107626 -0.587987
C  -0.12603 3.328866 1.012957
C  -2.548797 -2.109623 0.784987
C  -4.217199 -0.192349 -0.435381
C  -3.945167 -2.190885 0.940513
C  -4.789569 -1.233565 0.328401
H  2.234443 -2.09834 -1.286751
H  1.425049 -2.391146 0.278751
H  2.234629 1.630751 -0.730975
H  2.738009 0.356772 -1.889171
H  3.427227 -1.625081 1.531956
H  3.933273 -2.863208 0.328681
H  4.709727 1.159816 -0.646198
H  3.903267 0.850996 0.932864
H  5.954745 -0.787812 1.412804
H  6.547196 -0.361777 -0.232362
H  6.219177 -2.069423 0.177612
H  1.373504 1.792817 1.760243
H  0.0329 4.247159 1.573101
H  -1.88576 -2.853382 1.237993
H  -4.851228 0.563665 -0.909648
H  -4.377133 -3.004424 1.533765
H  -5.876842 -1.295673 0.440806
