program: Orca
programVersion: 5.0.2
elementType: O O O O N N N C C C C C C C C C C C C C C C C C C C C H H H H H H H H H H H H H H H H H H H
charge: 0
multiplicity: 1
keywords: wb97x-d3
keywords: def2-TZVPP
keywords: def2/J RIJCOSX
keywords: DEFGRID2
keywords: scfconv7
keywords: smallprint printgap noloewdin
keywords: NOSOSCF
formula: C20H19N3O4
InChI: InChI=1/C20H19N3O4/c1-14-18(19(23(2)22-14)27-17-6-4-3-5-7-17)12-21-26-13-15-8-10-16(11-9-15)20(24)25/h3-12,24H,13H2,1-2H3
46 atoms
O  1.141659 -0.347594 -0.864472
O  0.880827 1.369086 1.393433
O  -5.70684 -0.654873 -0.67302
O  -4.931782 0.552614 -2.378039
N  3.409611 -0.854304 -1.131077
N  4.616227 -0.290469 -0.997476
N  1.436202 2.542268 0.973457
C  3.026566 1.137407 -0.278215
C  2.434947 -0.039008 -0.701749
C  4.406084 0.911669 -0.506341
C  5.526542 1.848741 -0.232292
C  3.270933 -2.185027 -1.671786
C  2.447861 2.36983 0.220897
C  -1.518159 1.227682 1.250852
C  0.546128 -1.303339 -0.075599
C  -0.327017 1.570635 2.101504
C  -1.636204 1.723985 -0.046592
C  -2.508834 0.384931 1.739518
C  -3.704906 0.523016 -0.343891
C  -2.715407 1.374332 -0.835076
C  -3.597374 0.03548 0.955681
C  -0.663069 -1.798018 -0.541762
C  1.087324 -1.744866 1.122455
C  -1.349428 -2.733862 0.215692
C  0.389023 -2.688081 1.865412
C  -0.82886 -3.183396 1.422436
C  -4.826583 0.158874 -1.239935
H  5.580134 2.111148 0.825269
H  6.478309 1.402993 -0.517757
H  5.410984 2.780325 -0.789355
H  2.426453 -2.231775 -2.356384
H  4.177292 -2.42134 -2.221684
H  3.132346 -2.923546 -0.882243
H  2.935935 3.297544 -0.059658
H  -0.383298 2.604155 2.455225
H  -0.297548 0.923492 2.980644
H  -0.88621 2.391357 -0.451649
H  -2.424182 -0.021056 2.740269
H  -2.78572 1.765592 -1.841283
H  -4.344146 -0.630912 1.365146
H  -1.066269 -1.443607 -1.482017
H  2.029591 -1.360065 1.491775
H  -2.297971 -3.112292 -0.142798
H  0.806753 -3.030909 2.803339
H  -1.36714 -3.913701 2.011875
H  -6.414885 -0.866149 -1.300882
elementType: O N C H
totalener: -1238.79045668 hartree
nucrepener: 2493.06768677 hartree
electener: -3731.85814345 hartree
oneelecener: -6643.25047533 hartree
twoeener: 2911.39233188 hartree
cpcmener: -0.03572072 hartree
kineticenergy: 1233.62866329 hartree
xcener: -118.156556581090 hartree
chargesum: 0.0000000
charge: -0.310104 -0.217277 -0.286771 -0.450124 0.143217 -0.339208 -0.193916 -0.123045 0.217751 0.057418 -0.277542 -0.170074 0.016384 0.046523 0.341121 0.108471 -0.160079 -0.214000 -0.026748 -0.156359 -0.151261 -0.284611 -0.246906 -0.105363 -0.116775 -0.195020 0.477344 0.110594 0.098843 0.105831 0.127965 0.118583 0.119126 0.139209 0.109502 0.109981 0.142622 0.138571 0.140666 0.147857 0.143755 0.148182 0.152670 0.158846 0.155719 0.248432
qa: -0.3101 -0.2173 -0.2868 -0.4501 0.1432 -0.3392 -0.1939 -0.1230 0.2178 0.0574 -0.2775 -0.1701 0.0164 0.0465 0.3411 0.1085 -0.1601 -0.2140 -0.0267 -0.1564 -0.1513 -0.2846 -0.2469 -0.1054 -0.1168 -0.1950 0.4773 0.1106 0.0988 0.1058 0.1280 0.1186 0.1191 0.1392 0.1095 0.1100 0.1426 0.1386 0.1407 0.1479 0.1438 0.1482 0.1527 0.1588 0.1557 0.2484
va: 2.0669 1.9480 2.1914 2.0544 3.2937 2.9290 2.9216 3.6054 4.1088 3.9990 3.9533 3.8836 4.0019 3.5856 3.4874 3.7689 3.8990 3.9318 3.5308 4.0071 3.9556 3.9530 3.8846 3.8199 3.8785 3.9022 4.2317 0.9901 1.0153 0.9925 0.9909 1.0111 0.9854 1.0003 1.0230 0.9996 1.0148 1.0060 1.0233 1.0162 1.0121 1.0103 0.9940 0.9882 0.9911 1.0009
dispcorr: -0.027681419 hartree
energy: -1238.818138096935
dipole: 10.02242 -10.20865 -0.18623 -4.39910 3.09117 -1.30792 4.23743 -3.15616 1.08127
magnitude: 1.70718 au
magnitude: 4.33932 debye
