program: Orca
programVersion: 5.0.2
elementType: O O O O N N N C C C C C C C C C C C C C C C C C C C C H H H H H H H H H H H H H H H H H H H
charge: 0
multiplicity: 1
keywords: wb97x-d3
keywords: def2-TZVPP
keywords: def2/J RIJCOSX
keywords: DEFGRID2
keywords: scfconv7
keywords: smallprint printgap noloewdin
keywords: NOSOSCF
formula: C20H19N3O4
InChI: InChI=1/C20H19N3O4/c1-14-18(19(23(2)22-14)27-17-6-4-3-5-7-17)12-21-26-13-15-8-10-16(11-9-15)20(24)25/h3-12,24H,13H2,1-2H3
46 atoms
O  1.15622 -0.30278 -0.895139
O  0.889129 1.390999 1.388887
O  -5.641848 -0.753195 -0.643605
O  -4.924494 0.498038 -2.34337
N  3.419979 -0.859629 -1.097309
N  4.633851 -0.323521 -0.924289
N  1.466463 2.559178 0.984921
C  3.055726 1.133896 -0.241686
C  2.450911 -0.026214 -0.689799
C  4.435804 0.878971 -0.429547
C  5.566917 1.789667 -0.11294
C  3.268638 -2.184056 -1.648898
C  2.488284 2.375206 0.249194
C  -1.507348 1.248465 1.267494
C  0.514598 -1.261338 -0.146998
C  -0.311641 1.604612 2.106292
C  -2.474815 0.381559 1.759948
C  -1.647952 1.751499 -0.025174
C  -3.687217 0.49968 -0.314719
C  -3.55981 0.009408 0.9820
C  -2.724832 1.380945 -0.807378
C  -0.683157 -1.728414 -0.668854
C  0.999132 -1.732023 1.064044
C  -1.416449 -2.662134 0.045693
C  0.255257 -2.674259 1.762929
C  -0.952872 -3.139706 1.264912
C  -4.797911 0.100318 -1.208821
H  5.493333 2.725651 -0.669753
H  5.587842 2.04744 0.94691
H  6.518518 1.323926 -0.364944
H  3.071909 -2.920458 -0.86975
H  2.456287 -2.205337 -2.37265
H  4.192638 -2.44512 -2.15636
H  2.996012 3.295661 -0.020566
H  -0.363304 2.643136 2.444871
H  -0.277717 0.970533 2.994799
H  -2.372342 -0.026729 2.758202
H  -0.915451 2.438296 -0.430583
H  -4.286763 -0.678225 1.392043
H  -2.813683 1.775096 -1.811159
H  -1.041911 -1.35208 -1.618429
H  1.932966 -1.37031 1.47566
H  -2.357478 -3.015205 -0.355766
H  0.629122 -3.040617 2.710305
H  -1.528137 -3.868084 1.821077
H  -6.343805 -0.990804 -1.268453
elementType: O N C H
totalener: -1238.79032371 hartree
nucrepener: 2497.86527296 hartree
electener: -3736.65559667 hartree
oneelecener: -6652.85983853 hartree
twoeener: 2916.20424186 hartree
cpcmener: -0.03571838 hartree
kineticenergy: 1233.62949856 hartree
xcener: -118.156982428515 hartree
chargesum: 0.0000000
charge: -0.309562 -0.216614 -0.287050 -0.449775 0.143307 -0.339642 -0.190715 -0.124607 0.218510 0.057493 -0.277818 -0.170436 0.013968 0.034629 0.346802 0.108450 -0.206285 -0.148169 -0.023540 -0.152524 -0.165464 -0.286411 -0.252981 -0.097752 -0.111715 -0.201672 0.479111 0.106118 0.110406 0.098863 0.119089 0.128062 0.118382 0.139636 0.109117 0.109372 0.138873 0.141248 0.147543 0.140295 0.142075 0.148101 0.152208 0.158334 0.154894 0.247848
qa: -0.3096 -0.2166 -0.2871 -0.4498 0.1433 -0.3396 -0.1907 -0.1246 0.2185 0.0575 -0.2778 -0.1704 0.0140 0.0346 0.3468 0.1084 -0.2063 -0.1482 -0.0235 -0.1525 -0.1655 -0.2864 -0.2530 -0.0978 -0.1117 -0.2017 0.4791 0.1061 0.1104 0.0989 0.1191 0.1281 0.1184 0.1396 0.1091 0.1094 0.1389 0.1412 0.1475 0.1403 0.1421 0.1481 0.1522 0.1583 0.1549 0.2478
va: 2.0675 1.9511 2.1901 2.0549 3.2917 2.9299 2.9232 3.6077 4.1087 3.9996 3.9536 3.8839 4.0045 3.5991 3.4846 3.7696 3.9255 3.8889 3.5207 3.9565 4.0065 3.9538 3.8838 3.8087 3.8699 3.9045 4.2275 0.9924 0.9901 1.0153 0.9853 0.9906 1.0113 1.0001 1.0235 0.9996 1.0059 1.0147 1.0169 1.0234 1.0132 1.0109 0.9944 0.9883 0.9917 1.0013
dispcorr: -0.027944249 hartree
energy: -1238.818267964075
dipole: 9.90273 -10.09358 -0.19085 -4.42235 3.11096 -1.31139 4.24037 -3.17589 1.06449
magnitude: 1.69979 au
magnitude: 4.32053 debye
