program: Orca
programVersion: 5.0.2
elementType: O O O O N N N C C C C C C C C C C C C C C C C C C C C H H H H H H H H H H H H H H H H H H H
charge: 0
multiplicity: 1
keywords: wb97x-d3
keywords: def2-TZVPP
keywords: def2/J RIJCOSX
keywords: DEFGRID2
keywords: scfconv7
keywords: smallprint printgap noloewdin
keywords: NOSOSCF
formula: C20H19N3O4
InChI: InChI=1/C20H19N3O4/c1-14-18(19(23(2)22-14)27-17-6-4-3-5-7-17)12-21-26-13-15-8-10-16(11-9-15)20(24)25/h3-12,24H,13H2,1-2H3
46 atoms
O  1.652267 -0.107205 -1.22212
O  0.756287 2.029714 0.301566
O  -4.963337 -1.574183 1.259523
O  -5.808637 -0.720201 -0.616456
N  3.645951 -1.110728 -0.559191
N  4.73493 -0.881358 0.183965
N  1.79319 2.800609 0.736595
C  3.323702 0.877047 0.333114
C  2.771584 -0.096611 -0.487626
C  4.568162 0.308167 0.715136
C  5.597831 0.904137 1.606749
C  3.508954 -2.342523 -1.299529
C  2.916703 2.204258 0.740492
C  -1.600283 1.916737 0.181083
C  0.609701 -0.930134 -0.866353
C  -0.407544 2.823363 0.140979
C  -2.557963 1.949886 -0.825321
C  -1.76746 1.031407 1.243476
C  -3.813974 0.215566 0.274266
C  -3.659001 1.110816 -0.77891
C  -2.860581 0.187285 1.291882
C  -0.426244 -1.017074 -1.785673
C  0.569369 -1.640585 0.324013
C  -1.511872 -1.83227 -1.50973
C  -0.523796 -2.459752 0.579716
C  -1.565148 -2.562456 -0.329082
C  -4.961828 -0.71915 0.245944
H  5.197251 1.112229 2.599834
H  6.440325 0.223309 1.719852
H  5.97996 1.845326 1.20745
H  2.897913 -3.066004 -0.76021
H  3.06278 -2.153847 -2.273558
H  4.501393 -2.758335 -1.447497
H  3.709203 2.829321 1.138865
H  -0.370563 3.374052 -0.804716
H  -0.467709 3.559114 0.949606
H  -2.439013 2.62836 -1.660993
H  -1.035956 0.993594 2.04086
H  -4.385672 1.143084 -1.579636
H  -2.95368 -0.496626 2.123894
H  -0.381874 -0.448861 -2.706233
H  1.362232 -1.566596 1.057803
H  -2.321634 -1.893935 -2.225228
H  -0.556454 -3.014043 1.508723
H  -2.415379 -3.196975 -0.11735
H  -5.72836 -2.1663 1.194725
elementType: O N C H
totalener: -1238.79037745 hartree
nucrepener: 2488.71763573 hartree
electener: -3727.50801318 hartree
oneelecener: -6634.50480390 hartree
twoeener: 2906.99679071 hartree
cpcmener: -0.03668215 hartree
kineticenergy: 1233.63543345 hartree
xcener: -118.159005441979 hartree
chargesum: 0.0000000
charge: -0.303782 -0.217877 -0.285400 -0.448267 0.145809 -0.336995 -0.179005 -0.103555 0.186546 0.064022 -0.282697 -0.170679 0.019753 -0.000031 0.321190 0.108476 -0.146008 -0.195793 -0.047185 -0.134395 -0.152559 -0.294652 -0.217006 -0.079256 -0.134279 -0.198134 0.483133 0.113877 0.098837 0.104899 0.120944 0.130281 0.119038 0.128562 0.099884 0.100032 0.141896 0.143631 0.140533 0.148905 0.140689 0.156263 0.155840 0.156120 0.151525 0.246874
qa: -0.3038 -0.2179 -0.2854 -0.4483 0.1458 -0.3370 -0.1790 -0.1036 0.1865 0.0640 -0.2827 -0.1707 0.0198 -0.0000 0.3212 0.1085 -0.1460 -0.1958 -0.0472 -0.1344 -0.1526 -0.2947 -0.2170 -0.0793 -0.1343 -0.1981 0.4831 0.1139 0.0988 0.1049 0.1209 0.1303 0.1190 0.1286 0.0999 0.1000 0.1419 0.1436 0.1405 0.1489 0.1407 0.1563 0.1558 0.1561 0.1515 0.2469
va: 2.0814 1.9658 2.1894 2.0554 3.2912 2.9235 2.9697 3.5634 4.1536 3.9731 3.9558 3.8848 4.0517 3.6513 3.5185 3.8319 3.9235 3.8939 3.5174 3.9758 3.9292 3.9852 3.8556 3.7861 3.8637 3.8522 4.2167 0.9895 1.0158 0.9911 0.9844 0.9899 1.0110 1.0046 1.0005 1.0086 1.0036 1.0134 1.0209 1.0171 1.0144 0.9977 0.9910 0.9905 1.0000 1.0023
dispcorr: -0.027690904 hartree
energy: -1238.818068349830
dipole: 9.53129 -9.13607 0.39522 -2.93570 2.04224 -0.89346 1.83579 -1.48089 0.35490
magnitude: 1.03943 au
magnitude: 2.64203 debye
