program: Orca
programVersion: 5.0.2
elementType: O O O O N N N C C C C C C C C C C C C C C C C C C C C H H H H H H H H H H H H H H H H H H H
charge: 0
multiplicity: 1
keywords: wb97x-d3
keywords: def2-TZVPP
keywords: def2/J RIJCOSX
keywords: DEFGRID2
keywords: scfconv7
keywords: smallprint printgap noloewdin
keywords: NOSOSCF
formula: C20H19N3O4
InChI: InChI=1/C20H19N3O4/c1-14-18(19(23(2)22-14)27-17-6-4-3-5-7-17)12-21-26-13-15-8-10-16(11-9-15)20(24)25/h3-12,24H,13H2,1-2H3
46 atoms
O  1.669102 -0.152566 -1.243026
O  0.745229 2.025652 0.202429
O  -5.860677 -0.630728 -0.484966
O  -5.00329 -1.619053 1.31914
N  3.676151 -1.106802 -0.546924
N  4.760723 -0.838991 0.189173
N  1.771989 2.822023 0.616561
C  3.326031 0.903406 0.281076
C  2.787545 -0.103239 -0.508184
C  4.577055 0.363805 0.682985
C  5.593446 1.004337 1.55892
C  3.56043 -2.361133 -1.251305
C  2.901787 2.238341 0.643488
C  -1.614817 1.888777 0.125416
C  0.63056 -0.965558 -0.854296
C  -0.428314 2.798889 0.019313
C  -1.743644 1.029221 1.214877
C  -2.607722 1.899463 -0.846102
C  -3.826094 0.196294 0.33789
C  -2.834384 0.189122 1.318091
C  -3.711011 1.067026 -0.741681
C  -0.416527 -1.075441 -1.759066
C  0.60259 -1.645394 0.354346
C  -1.499613 -1.882136 -1.449646
C  -0.488054 -2.456585 0.643814
C  -1.540281 -2.581475 -0.249749
C  -4.938535 -0.772501 0.458433
H  5.182526 1.241384 2.541262
H  6.445163 0.341208 1.702591
H  5.964508 1.936558 1.129464
H  4.559052 -2.769377 -1.377108
H  2.952617 -3.07604 -0.696821
H  3.12196 -2.207048 -2.235002
H  3.68565 2.885093 1.024186
H  -0.411378 3.299722 -0.954336
H  -0.481967 3.5756 0.789066
H  -0.984738 1.011883 1.987077
H  -2.516508 2.558287 -1.700943
H  -2.911567 -0.480969 2.163703
H  -4.462292 1.091386 -1.519131
H  -0.381697 -0.530968 -2.694556
H  1.404373 -1.55236 1.076355
H  -2.317693 -1.961974 -2.153916
H  -0.511156 -2.986443 1.587296
H  -2.38903 -3.208443 -0.010549
H  -6.553524 -1.299852 -0.374294
elementType: O N C H
totalener: -1238.79043936 hartree
nucrepener: 2485.41138830 hartree
electener: -3724.20182766 hartree
oneelecener: -6628.11176198 hartree
twoeener: 2903.90993432 hartree
cpcmener: -0.03646787 hartree
kineticenergy: 1233.62706443 hartree
xcener: -118.157456703952 hartree
chargesum: -0.0000000
charge: -0.304321 -0.218183 -0.286767 -0.451264 0.145810 -0.336733 -0.179654 -0.102340 0.185390 0.063408 -0.282117 -0.170292 0.020642 0.006935 0.324385 0.109498 -0.190471 -0.158985 -0.043975 -0.136343 -0.148909 -0.294111 -0.218032 -0.082999 -0.135373 -0.197249 0.481302 0.113935 0.098757 0.104831 0.119012 0.120597 0.130105 0.128485 0.099974 0.099532 0.143753 0.141038 0.143275 0.147037 0.140217 0.156149 0.155299 0.156621 0.153828 0.248301
qa: -0.3043 -0.2182 -0.2868 -0.4513 0.1458 -0.3367 -0.1797 -0.1023 0.1854 0.0634 -0.2821 -0.1703 0.0206 0.0069 0.3244 0.1095 -0.1905 -0.1590 -0.0440 -0.1363 -0.1489 -0.2941 -0.2180 -0.0830 -0.1354 -0.1972 0.4813 0.1139 0.0988 0.1048 0.1190 0.1206 0.1301 0.1285 0.1000 0.0995 0.1438 0.1410 0.1433 0.1470 0.1402 0.1561 0.1553 0.1566 0.1538 0.2483
va: 2.0822 1.9665 2.1939 2.0465 3.2908 2.9247 2.9692 3.5639 4.1533 3.9739 3.9569 3.8846 4.0504 3.6423 3.5204 3.8304 3.9034 3.9296 3.5259 3.9274 3.9865 3.9861 3.8555 3.7883 3.8679 3.8531 4.2149 0.9895 1.0158 0.9911 1.0109 0.9846 0.9900 1.0044 1.0002 1.0095 1.0143 1.0040 1.0221 1.0164 1.0146 0.9976 0.9910 0.9906 0.9973 1.0012
dispcorr: -0.027567382 hartree
energy: -1238.818006739162
dipole: 8.88065 -9.13742 -0.25677 -2.04619 1.87185 -0.17434 0.24787 -1.34854 -1.10067
magnitude: 1.14359 au
magnitude: 2.90678 debye
