program: Orca
programVersion: 5.0.2
elementType: O O O O N N N C C C C C C C C C C C C C C C C C C C C H H H H H H H H H H H H H H H H H H H
charge: 0
multiplicity: 1
keywords: wb97x-d3
keywords: def2-TZVPP
keywords: def2/J RIJCOSX
keywords: DEFGRID2
keywords: scfconv7
keywords: smallprint printgap noloewdin
keywords: NOSOSCF
formula: C20H19N3O4
InChI: InChI=1/C20H19N3O4/c1-14-18(19(23(2)22-14)27-17-6-4-3-5-7-17)12-21-26-13-15-8-10-16(11-9-15)20(24)25/h3-12,24H,13H2,1-2H3
46 atoms
O  2.802919 -2.202846 0.278668
O  0.800067 2.144116 0.616723
O  -6.417343 0.987394 0.194343
O  -5.461866 -0.60971 -1.031518
N  4.308235 -0.688647 -0.660511
N  4.613024 0.614127 -0.636972
N  0.750058 1.217895 1.621903
C  2.785502 0.24695 0.62598
C  3.242617 -0.948124 0.102083
C  3.702933 1.199507 0.116019
C  3.775804 2.661625 0.3788
C  5.138585 -1.622452 -1.379979
C  1.679062 0.353239 1.56117
C  -1.626583 2.303949 0.427859
C  1.515255 -2.510669 -0.108712
C  -0.319746 2.998046 0.698931
C  -1.702922 1.17927 -0.389402
C  -2.797207 2.813105 0.980395
C  -4.092998 1.086255 -0.082458
C  -2.921733 0.573851 -0.636396
C  -4.021569 2.219459 0.725465
C  0.890371 -3.536287 0.583383
C  0.881789 -1.86219 -1.158406
C  -0.394938 -3.91054 0.221037
C  -0.406874 -2.245306 -1.503839
C  -1.051817 -3.264509 -0.817777
C  -5.370915 0.393634 -0.363493
H  4.775806 3.033554 0.157938
H  3.07054 3.221119 -0.236714
H  3.552491 2.891139 1.42065
H  5.477672 -1.153388 -2.299667
H  6.004815 -1.913664 -0.786444
H  4.567801 -2.511585 -1.633454
H  1.600324 -0.405611 2.333481
H  -0.143913 3.766799 -0.057555
H  -0.353641 3.501473 1.670351
H  -0.809586 0.762122 -0.835966
H  -2.753663 3.68177 1.626688
H  -2.958907 -0.305807 -1.265729
H  -4.910102 2.64024 1.176014
H  1.403411 -4.032862 1.397556
H  1.375151 -1.070638 -1.708395
H  -0.885931 -4.70889 0.76215
H  -0.903645 -1.741366 -2.322742
H  -2.057341 -3.554344 -1.092343
H  -7.22727 0.497328 -0.014233
elementType: O N C H
totalener: -1238.79130926 hartree
nucrepener: 2394.89786506 hartree
electener: -3633.68917432 hartree
oneelecener: -6446.78507604 hartree
twoeener: 2813.09590173 hartree
cpcmener: -0.03746120 hartree
kineticenergy: 1233.61981269 hartree
xcener: -118.152176379414 hartree
chargesum: -0.0000000
charge: -0.335268 -0.235093 -0.286292 -0.452607 0.111991 -0.333770 -0.145095 -0.121736 0.230254 0.084778 -0.271979 -0.160989 -0.029845 0.024191 0.288393 0.112738 -0.174746 -0.173240 -0.063780 -0.128874 -0.151715 -0.251510 -0.167671 -0.109716 -0.194356 -0.167969 0.476691 0.101293 0.096413 0.107848 0.117027 0.123450 0.114243 0.143924 0.112861 0.101701 0.143247 0.141018 0.138379 0.148653 0.147090 0.157930 0.157629 0.168143 0.158369 0.247999
qa: -0.3353 -0.2351 -0.2863 -0.4526 0.1120 -0.3338 -0.1451 -0.1217 0.2303 0.0848 -0.2720 -0.1610 -0.0298 0.0242 0.2884 0.1127 -0.1747 -0.1732 -0.0638 -0.1289 -0.1517 -0.2515 -0.1677 -0.1097 -0.1944 -0.1680 0.4767 0.1013 0.0964 0.1078 0.1170 0.1235 0.1142 0.1439 0.1129 0.1017 0.1432 0.1410 0.1384 0.1487 0.1471 0.1579 0.1576 0.1681 0.1584 0.2480
va: 2.0810 1.9656 2.1918 2.0501 3.3262 2.9144 2.9233 3.5932 4.0376 3.9820 3.9563 3.8951 4.0307 3.7023 3.6474 3.8190 3.9590 3.9647 3.6418 3.9925 4.0007 4.0089 3.8374 3.8965 3.8727 3.8826 4.2280 1.0150 1.0011 0.9955 1.0019 0.9872 1.0008 1.0050 0.9923 1.0134 1.0156 1.0024 1.0265 1.0154 1.0086 0.9979 0.9886 0.9837 0.9910 1.0013
dispcorr: -0.023910815 hartree
energy: -1238.815220075258
dipole: 8.26848 -8.25551 0.01297 2.38602 -2.37823 0.00779 -1.77265 1.90825 0.13560
magnitude: 0.13644 au
magnitude: 0.34680 debye
