program: Orca
programVersion: 5.0.2
elementType: O O O O N N N C C C C C C C C C C C C C C C C C C C C H H H H H H H H H H H H H H H H H H H
charge: 0
multiplicity: 1
keywords: wb97x-d3
keywords: def2-TZVPP
keywords: def2/J RIJCOSX
keywords: DEFGRID2
keywords: scfconv7
keywords: smallprint printgap noloewdin
keywords: NOSOSCF
formula: C20H19N3O4
InChI: InChI=1/C20H19N3O4/c1-14-18(19(23(2)22-14)27-17-6-4-3-5-7-17)12-21-26-13-15-8-10-16(11-9-15)20(24)25/h3-12,24H,13H2,1-2H3
46 atoms
O  1.934863 -1.874273 0.688697
O  1.162289 2.730026 0.868294
O  -4.666127 -1.069584 0.356835
O  -4.589687 -0.435446 -1.778244
N  3.411936 -0.918541 -0.869796
N  3.997974 0.25238 -1.136617
N  1.27031 1.977021 2.007084
C  2.67499 0.470091 0.669449
C  2.61908 -0.826453 0.204386
C  3.567271 1.105118 -0.227056
C  4.057233 2.508623 -0.203125
C  3.609613 -2.061379 -1.726849
C  1.988747 0.940352 1.862187
C  -1.206618 2.502874 0.510202
C  0.693363 -2.164312 0.165194
C  -0.07713 3.426725 0.874191
C  -1.632931 2.396638 -0.810621
C  -1.796973 1.687531 1.472549
C  -3.191522 0.666017 -0.202668
C  -2.619817 1.493978 -1.165504
C  -2.775146 0.771776 1.122616
C  0.050922 -3.264042 0.717094
C  0.104835 -1.429618 -0.853175
C  -1.193767 -3.635219 0.234392
C  -1.139506 -1.823495 -1.331242
C  -1.794378 -2.921412 -0.795091
C  -4.208385 -0.321054 -0.63662
H  4.258693 2.841376 0.814857
H  4.977187 2.601529 -0.778026
H  3.327637 3.197317 -0.629828
H  4.595323 -1.98837 -2.177067
H  3.559702 -2.978702 -1.145951
H  2.859006 -2.097356 -2.516068
H  2.061201 0.339674 2.763522
H  0.029937 4.218068 0.13153
H  -0.243437 3.892426 1.849436
H  -1.189121 3.026628 -1.572056
H  -1.488683 1.762372 2.507389
H  -2.9363 1.427837 -2.197952
H  -3.205664 0.147076 1.893208
H  0.523968 -3.823062 1.514694
H  0.587324 -0.559988 -1.281011
H  -1.693427 -4.493486 0.66458
H  -1.593498 -1.259908 -2.135588
H  -2.760969 -3.2207 -1.178047
H  -5.324829 -1.698414 0.023457
elementType: O N C H
totalener: -1238.78927905 hartree
nucrepener: 2498.61639973 hartree
electener: -3737.40567879 hartree
oneelecener: -6654.18679237 hartree
twoeener: 2916.78111358 hartree
cpcmener: -0.03571697 hartree
kineticenergy: 1233.63003996 hartree
xcener: -118.151505118821 hartree
chargesum: 0.0000000
charge: -0.327549 -0.230371 -0.283828 -0.445426 0.118331 -0.328156 -0.152518 -0.095328 0.213953 0.063219 -0.269709 -0.168362 -0.019888 -0.024186 0.326883 0.117857 -0.170993 -0.152018 -0.024140 -0.141417 -0.160445 -0.261821 -0.204639 -0.103041 -0.173099 -0.194992 0.463564 0.109261 0.101057 0.097463 0.120609 0.125385 0.121184 0.144440 0.104990 0.104074 0.144776 0.139698 0.143264 0.147836 0.146075 0.152434 0.156761 0.162679 0.157547 0.248584
qa: -0.3275 -0.2304 -0.2838 -0.4454 0.1183 -0.3282 -0.1525 -0.0953 0.2140 0.0632 -0.2697 -0.1684 -0.0199 -0.0242 0.3269 0.1179 -0.1710 -0.1520 -0.0241 -0.1414 -0.1604 -0.2618 -0.2046 -0.1030 -0.1731 -0.1950 0.4636 0.1093 0.1011 0.0975 0.1206 0.1254 0.1212 0.1444 0.1050 0.1041 0.1448 0.1397 0.1433 0.1478 0.1461 0.1524 0.1568 0.1627 0.1575 0.2486
va: 2.0956 1.9516 2.1936 2.0491 3.3195 2.9220 2.8921 3.5960 4.0662 4.0070 3.9485 3.8848 4.0110 3.6447 3.6295 3.8055 3.9643 3.9064 3.5248 3.9407 3.9905 4.0177 3.8347 3.9041 3.8777 3.8784 4.2161 0.9957 1.0137 1.0029 1.0069 0.9935 0.9853 1.0058 0.9975 1.0143 1.0023 1.0229 1.0216 1.0171 1.0090 1.0018 0.9890 0.9913 0.9968 1.0012
dispcorr: -0.027160276 hartree
energy: -1238.816439328726
dipole: 5.80176 -6.08176 -0.28000 1.07376 -2.05353 -0.97978 -3.09967 3.53800 0.43833
magnitude: 1.10928 au
magnitude: 2.81957 debye
