program: Orca
programVersion: 5.0.2
elementType: O O O O N N N C C C C C C C C C C C C C C C C C C C C H H H H H H H H H H H H H H H H H H H
charge: 0
multiplicity: 1
keywords: wb97x-d3
keywords: def2-TZVPP
keywords: def2/J RIJCOSX
keywords: DEFGRID2
keywords: scfconv7
keywords: smallprint printgap noloewdin
keywords: NOSOSCF
formula: C20H19N3O4
InChI: InChI=1/C20H19N3O4/c1-14-18(19(23(2)22-14)27-17-6-4-3-5-7-17)12-21-26-13-15-8-10-16(11-9-15)20(24)25/h3-12,24H,13H2,1-2H3
46 atoms
O  2.523468 -2.152262 0.105509
O  0.93533 2.184764 0.632331
O  -5.378481 -0.884568 0.242957
O  -5.579943 0.159278 -1.714615
N  4.070105 -0.768939 -0.957667
N  4.524876 0.489201 -0.938114
N  1.000974 1.368921 1.722334
C  2.865206 0.257272 0.568063
C  3.095518 -0.95013 -0.055639
C  3.800006 1.127385 -0.044873
C  4.035671 2.56664 0.244207
C  4.681522 -1.748486 -1.816184
C  1.904175 0.481236 1.639217
C  -1.483023 2.215948 0.367506
C  1.146941 -2.22723 0.085322
C  -0.231666 2.982775 0.705471
C  -2.079342 1.379147 1.30651
C  -2.056381 2.318308 -0.896454
C  -3.78484 0.765442 -0.276857
C  -3.213881 0.653736 0.988568
C  -3.201722 1.610269 -1.216765
C  0.572731 -3.261654 0.806138
C  0.363371 -1.337987 -0.634484
C  -0.807423 -3.396603 0.814516
C  -1.013756 -1.483296 -0.610043
C  -1.607229 -2.506558 0.113345
C  -4.995408 0.009232 -0.675471
H  4.06121 2.755115 1.31773
H  4.983341 2.885296 -0.185182
H  3.242237 3.187023 -0.171817
H  3.990759 -2.567969 -1.99424
H  4.926143 -1.27562 -2.763233
H  5.59484 -2.146516 -1.373656
H  1.92112 -0.184122 2.496112
H  -0.074073 3.784678 -0.017509
H  -0.314556 3.434394 1.698188
H  -1.641937 1.284268 2.290923
H  -1.606526 2.965815 -1.639547
H  -3.650005 0.001494 1.731728
H  -3.644879 1.703788 -2.199026
H  1.202263 -3.946472 1.359026
H  0.807628 -0.521713 -1.188579
H  -1.257158 -4.199866 1.383078
H  -1.623682 -0.778863 -1.158633
H  -2.684886 -2.598979 0.137707
H  -6.173826 -1.324426 -0.08411
totalener: -1238.76194592 hartree
nucrepener: 2459.83277343 hartree
electener: -3698.59471935 hartree
oneelecener: -6575.66066283 hartree
twoeener: 2877.06594348 hartree
kineticenergy: 1233.70503629 hartree
xcener: -118.161696824881 hartree
chargesum: -0.0000000
charge: -0.324772 -0.197520 -0.266737 -0.347605 0.099593 -0.287877 -0.093166 -0.140837 0.208738 0.110539 -0.271540 -0.165025 -0.046150 -0.076415 0.287225 0.092838 -0.024250 -0.096572 -0.067543 -0.203452 -0.145967 -0.239767 -0.163547 -0.070628 -0.110397 -0.166010 0.432197 0.094757 0.101778 0.094701 0.105757 0.115988 0.109844 0.117069 0.083419 0.095117 0.122455 0.114923 0.129404 0.136966 0.124144 0.133531 0.124437 0.153203 0.118321 0.198834
qa: -0.3248 -0.1975 -0.2667 -0.3476 0.0996 -0.2879 -0.0932 -0.1408 0.2087 0.1105 -0.2715 -0.1650 -0.0461 -0.0764 0.2872 0.0928 -0.0243 -0.0966 -0.0675 -0.2035 -0.1460 -0.2398 -0.1635 -0.0706 -0.1104 -0.1660 0.4322 0.0948 0.1018 0.0947 0.1058 0.1160 0.1098 0.1171 0.0834 0.0951 0.1225 0.1149 0.1294 0.1370 0.1241 0.1335 0.1244 0.1532 0.1183 0.1988
va: 2.1027 1.9783 2.1832 2.1563 3.3020 2.9112 2.9066 3.6296 4.0334 3.9766 3.9437 3.9092 4.0371 3.7837 3.7426 3.8680 3.8330 3.9119 3.6044 4.0195 4.0162 4.0547 3.8995 3.9556 3.8906 3.9772 4.2277 0.9974 1.0158 1.0037 1.0031 1.0035 0.9888 1.0086 0.9995 1.0119 1.0307 1.0100 1.0263 1.0227 1.0151 1.0136 0.9986 0.9872 1.0158 1.0462
dispcorr: -0.026480055 hartree
energy: -1238.788425969946
dipole: 7.57966 -7.56175 0.01791 2.29583 -2.89306 -0.59723 -0.46943 0.90664 0.43721
magnitude: 0.74038 au
magnitude: 1.88189 debye
