program: Orca
programVersion: 5.0.2
elementType: O O O O N N N C C C C C C C C C C C C C C C C C C C C H H H H H H H H H H H H H H H H H H H
charge: 0
multiplicity: 1
keywords: wb97x-d3
keywords: def2-TZVPP
keywords: def2/J RIJCOSX
keywords: DEFGRID2
keywords: scfconv7
keywords: smallprint printgap noloewdin
keywords: NOSOSCF
formula: C20H19N3O4
InChI: InChI=1/C20H19N3O4/c1-14-18(19(23(2)22-14)27-17-6-4-3-5-7-17)12-21-26-13-15-8-10-16(11-9-15)20(24)25/h3-12,24H,13H2,1-2H3
46 atoms
O  2.590521 -1.217312 -1.057913
O  0.500846 0.514147 -1.455441
O  -5.16555 1.093117 2.547132
O  -6.220842 2.213155 0.936681
N  4.091773 -0.67766 0.618895
N  4.506057 0.33691 1.381449
N  0.786484 1.815516 -1.169657
C  2.790476 1.008396 0.066279
C  3.069386 -0.327022 -0.178025
C  3.744718 1.356713 1.060514
C  3.928989 2.680479 1.716501
C  4.719272 -1.971802 0.709802
C  1.843598 1.959488 -0.480312
C  -1.90679 0.738663 -1.196818
C  1.556389 -2.035357 -0.693555
C  -0.746584 0.426831 -2.102064
C  -2.978165 1.494222 -1.655765
C  -1.937159 0.248998 0.10503
C  -4.089049 1.267694 0.464807
C  -4.064147 1.753413 -0.837987
C  -3.014404 0.511947 0.930562
C  1.013835 -2.814459 -1.705599
C  1.069449 -2.1193 0.602204
C  -0.032239 -3.674125 -1.416185
C  0.023728 -2.990781 0.876059
C  -0.53587 -3.766571 -0.125774
C  -5.265341 1.583899 1.306967
H  3.026438 3.001884 2.237732
H  4.737089 2.624392 2.442669
H  4.182207 3.457293 0.993096
H  5.631146 -1.851318 1.285773
H  4.073831 -2.69409 1.210396
H  4.968123 -2.350122 -0.279573
H  2.047704 3.001317 -0.257658
H  -0.809015 -0.609608 -2.443041
H  -0.767488 1.073185 -2.985573
H  -2.961091 1.89488 -2.662128
H  -1.112083 -0.345903 0.474268
H  -4.892828 2.344579 -1.203263
H  -3.015083 0.123539 1.939375
H  1.408589 -2.734473 -2.710014
H  1.477995 -1.503964 1.39382
H  -0.457744 -4.275786 -2.208538
H  -0.357628 -3.053101 1.886846
H  -1.355227 -4.436485 0.094808
H  -5.965539 1.339984 3.028206
totalener: -1238.76347533 hartree
nucrepener: 2418.50133408 hartree
electener: -3657.26480941 hartree
oneelecener: -6492.91231709 hartree
twoeener: 2835.64750768 hartree
kineticenergy: 1233.70174376 hartree
xcener: -118.162339319720 hartree
chargesum: -0.0000000
charge: -0.292273 -0.194232 -0.264958 -0.355760 0.134881 -0.296689 -0.141693 -0.070505 0.149902 0.082228 -0.294375 -0.180602 0.017639 0.053376 0.290451 0.056361 -0.131354 -0.150779 -0.082140 -0.108521 -0.144947 -0.273775 -0.152347 -0.085793 -0.187748 -0.108123 0.416110 0.106133 0.102908 0.093621 0.120220 0.108277 0.120838 0.099515 0.101852 0.100735 0.108040 0.130357 0.136998 0.127197 0.130203 0.144922 0.129473 0.131754 0.127125 0.195497
qa: -0.2923 -0.1942 -0.2650 -0.3558 0.1349 -0.2967 -0.1417 -0.0705 0.1499 0.0822 -0.2944 -0.1806 0.0176 0.0534 0.2905 0.0564 -0.1314 -0.1508 -0.0821 -0.1085 -0.1449 -0.2738 -0.1523 -0.0858 -0.1877 -0.1081 0.4161 0.1061 0.1029 0.0936 0.1202 0.1083 0.1208 0.0995 0.1019 0.1007 0.1080 0.1304 0.1370 0.1272 0.1302 0.1449 0.1295 0.1318 0.1271 0.1955
va: 2.1161 1.9686 2.1869 2.1471 3.2747 2.9198 2.9886 3.5838 4.1620 3.9129 3.9481 3.8986 4.0484 3.6942 3.6785 3.8553 3.9917 3.9199 3.7218 4.0113 4.0557 3.9925 3.8303 3.9240 3.9728 3.9298 4.2619 0.9906 1.0177 0.9927 1.0121 0.9870 0.9913 1.0072 0.9891 1.0179 1.0125 1.0199 1.0207 1.0265 1.0151 0.9989 0.9970 0.9998 0.9992 1.0485
dispcorr: -0.024685343 hartree
energy: -1238.788160675432
dipole: 9.23056 -8.38874 0.84182 -4.69698 3.43761 -1.25937 2.17913 -1.97063 0.20850
magnitude: 1.52910 au
magnitude: 3.88667 debye
