program: Orca
programVersion: 5.0.2
elementType: O O O O N N N C C C C C C C C C C C C C C C C C C C C H H H H H H H H H H H H H H H H H H H
charge: 0
multiplicity: 1
keywords: wb97x-d3
keywords: def2-TZVPP
keywords: def2/J RIJCOSX
keywords: DEFGRID2
keywords: scfconv7
keywords: smallprint printgap noloewdin
keywords: NOSOSCF
formula: C20H19N3O4
InChI: InChI=1/C20H19N3O4/c1-14-18(19(23(2)22-14)27-17-6-4-3-5-7-17)12-21-26-13-15-8-10-16(11-9-15)20(24)25/h3-12,24H,13H2,1-2H3
46 atoms
O  1.468858 -1.14033 -0.69398
O  0.556132 0.751535 1.0985
O  -6.488911 1.577283 -0.809527
O  -5.388271 1.01876 -2.663743
N  3.714091 -0.865644 -1.214651
N  4.665076 0.066721 -1.309731
N  0.852222 2.015875 0.680334
C  2.756017 0.990088 -0.524629
C  2.559789 -0.362363 -0.746753
C  4.107521 1.187289 -0.912426
C  4.874759 2.46248 -0.896682
C  3.983314 -2.232716 -1.582393
C  1.887238 2.052549 -0.056189
C  -1.873965 0.876661 0.935704
C  1.211381 -1.888045 0.426471
C  -0.654912 0.728627 1.806539
C  -3.079211 1.260859 1.514239
C  -1.841763 0.605817 -0.428303
C  -4.194348 1.105102 -0.608951
C  -4.231807 1.371361 0.757483
C  -2.989422 0.723752 -1.191465
C  0.013262 -2.586815 0.424375
C  2.075644 -1.963059 1.507916
C  -0.319524 -3.368004 1.519119
C  1.729108 -2.753824 2.594135
C  0.535062 -3.458188 2.609046
C  -5.386876 1.220665 -1.478397
H  5.890199 2.290322 -1.247624
H  4.419042 3.212654 -1.545452
H  4.928924 2.888258 0.105976
H  4.109386 -2.864805 -0.702901
H  3.172687 -2.632759 -2.187994
H  4.900842 -2.242179 -2.16205
H  2.156863 3.061476 -0.349938
H  -0.657645 1.495809 2.588385
H  -0.671851 -0.248037 2.29834
H  -3.117716 1.486653 2.573641
H  -0.917577 0.308566 -0.904434
H  -5.153279 1.675865 1.233594
H  -2.955178 0.520935 -2.253399
H  -0.655127 -2.505875 -0.422761
H  2.997229 -1.395783 1.526133
H  -1.257548 -3.907057 1.518129
H  2.402449 -2.809745 3.439296
H  0.272171 -4.069924 3.461099
H  -7.214686 1.634695 -1.443603
totalener: -1238.76453924 hartree
nucrepener: 2418.33897981 hartree
electener: -3657.10351905 hartree
oneelecener: -6492.62051335 hartree
twoeener: 2835.51699431 hartree
kineticenergy: 1233.68846396 hartree
xcener: -118.160831599609 hartree
chargesum: -0.0000000
charge: -0.311997 -0.200921 -0.266262 -0.355934 0.144949 -0.296894 -0.147016 -0.056401 0.153554 0.073989 -0.292605 -0.177360 0.014261 0.106617 0.286129 0.063281 -0.163879 -0.185794 -0.087977 -0.130822 -0.121706 -0.252009 -0.160655 -0.094189 -0.124501 -0.148257 0.420656 0.102781 0.094238 0.106069 0.108235 0.119539 0.121079 0.104494 0.105423 0.106753 0.107871 0.128886 0.131965 0.135717 0.124532 0.135341 0.128004 0.127540 0.126590 0.196684
qa: -0.3120 -0.2009 -0.2663 -0.3559 0.1449 -0.2969 -0.1470 -0.0564 0.1536 0.0740 -0.2926 -0.1774 0.0143 0.1066 0.2861 0.0633 -0.1639 -0.1858 -0.0880 -0.1308 -0.1217 -0.2520 -0.1607 -0.0942 -0.1245 -0.1483 0.4207 0.1028 0.0942 0.1061 0.1082 0.1195 0.1211 0.1045 0.1054 0.1068 0.1079 0.1289 0.1320 0.1357 0.1245 0.1353 0.1280 0.1275 0.1266 0.1967
va: 2.0759 1.9656 2.1870 2.1474 3.2827 2.9209 2.9728 3.6172 4.1250 3.9360 3.9439 3.8937 4.0278 3.6040 3.6739 3.8798 4.0205 3.9591 3.7167 4.0274 4.0644 4.0057 3.9095 3.9348 3.9687 3.9603 4.2614 1.0177 0.9932 0.9903 0.9875 0.9930 1.0120 1.0069 1.0177 0.9814 1.0112 1.0185 1.0211 1.0234 1.0168 1.0029 0.9993 1.0001 1.0007 1.0478
dispcorr: -0.024882938 hartree
energy: -1238.789422175798
dipole: 11.85180 -11.49382 0.35798 -3.80062 3.08938 -0.71124 5.18955 -4.23848 0.95107
magnitude: 1.24039 au
magnitude: 3.15281 debye
