program: Orca
programVersion: 5.0.2
elementType: O O O O N N N C C C C C C C C C C C C C C C C C C C C H H H H H H H H H H H H H H H H H H H
charge: 0
multiplicity: 1
keywords: wb97x-d3
keywords: def2-TZVPP
keywords: def2/J RIJCOSX
keywords: DEFGRID2
keywords: scfconv7
keywords: smallprint printgap noloewdin
keywords: NOSOSCF
formula: C20H19N3O4
InChI: InChI=1/C20H19N3O4/c1-14-18(19(23(2)22-14)27-17-6-4-3-5-7-17)12-21-26-13-15-8-10-16(11-9-15)20(24)25/h3-12,24H,13H2,1-2H3
46 atoms
O  1.477087 -1.012327 0.576851
O  0.556485 0.984247 -1.112683
O  -6.390431 0.934241 1.318377
O  -5.086442 0.585913 3.090516
N  3.781462 -0.905011 0.841199
N  4.799233 -0.040934 0.846885
N  0.933598 2.209753 -0.648064
C  2.880914 1.031613 0.317807
C  2.618979 -0.31184 0.524335
C  4.278105 1.126862 0.547977
C  5.124953 2.348114 0.465139
C  3.993215 -2.298103 1.142916
C  2.030852 2.161295 -0.007703
C  -1.857956 0.995112 -0.747965
C  1.043693 -1.706043 -0.524867
C  -0.706797 1.029423 -1.717983
C  -1.685666 0.751944 0.609683
C  -3.148356 1.173528 -1.238673
C  -4.069819 0.860097 0.958283
C  -2.781309 0.689326 1.453063
C  -4.24643 1.104297 -0.401918
C  -0.19175 -2.323177 -0.400461
C  1.770451 -1.800799 -1.701742
C  -0.705341 -3.037498 -1.470305
C  1.24342 -2.523936 -2.762181
C  0.008081 -3.144244 -2.656022
C  -5.201003 0.776122 1.908588
H  4.802952 3.109467 1.178054
H  6.160764 2.099661 0.686594
H  5.087605 2.796484 -0.528397
H  4.981864 -2.391917 1.580695
H  3.250841 -2.653935 1.854627
H  3.940037 -2.912581 0.243809
H  2.372777 3.137862 0.318309
H  -0.747313 0.140411 -2.354028
H  -0.788137 1.908409 -2.36637
H  -0.696816 0.607964 1.020709
H  -3.298887 1.369663 -2.294228
H  -2.638976 0.504223 2.509303
H  -5.236811 1.245439 -0.811502
H  -0.751481 -2.225168 0.52019
H  2.721233 -1.295863 -1.813408
H  -1.673858 -3.509722 -1.373818
H  1.807938 -2.592962 -3.682773
H  -0.39582 -3.703143 -3.489146
H  -7.070633 0.870243 2.000862
totalener: -1238.76428043 hartree
nucrepener: 2434.95632674 hartree
electener: -3673.72060718 hartree
oneelecener: -6525.83866080 hartree
twoeener: 2852.11805363 hartree
kineticenergy: 1233.69608720 hartree
xcener: -118.163268182603 hartree
chargesum: -0.0000000
charge: -0.309857 -0.204179 -0.266182 -0.356254 0.144686 -0.297533 -0.146200 -0.055849 0.157231 0.072313 -0.290429 -0.176677 0.010696 0.085629 0.284967 0.070479 -0.185653 -0.161362 -0.076749 -0.127065 -0.136232 -0.252739 -0.160770 -0.089043 -0.130213 -0.149264 0.420761 0.093326 0.102577 0.105657 0.120648 0.119714 0.107955 0.105343 0.111271 0.111756 0.130742 0.109849 0.136452 0.131795 0.125061 0.134907 0.128150 0.127265 0.126300 0.196721
qa: -0.3099 -0.2042 -0.2662 -0.3563 0.1447 -0.2975 -0.1462 -0.0558 0.1572 0.0723 -0.2904 -0.1767 0.0107 0.0856 0.2850 0.0705 -0.1857 -0.1614 -0.0767 -0.1271 -0.1362 -0.2527 -0.1608 -0.0890 -0.1302 -0.1493 0.4208 0.0933 0.1026 0.1057 0.1206 0.1197 0.1080 0.1053 0.1113 0.1118 0.1307 0.1098 0.1365 0.1318 0.1251 0.1349 0.1282 0.1273 0.1263 0.1967
va: 2.0796 1.9703 2.1868 2.1474 3.2815 2.9230 2.9671 3.6206 4.1215 3.9399 3.9437 3.8933 4.0254 3.5907 3.6718 3.8833 3.9356 4.0187 3.6982 4.0625 4.0322 4.0081 3.8987 3.9302 3.9640 3.9559 4.2617 0.9937 1.0175 0.9904 1.0121 0.9926 0.9880 1.0075 0.9801 1.0179 1.0184 1.0097 1.0234 1.0214 1.0176 1.0046 0.9989 1.0005 1.0007 1.0476
dispcorr: -0.025503420 hartree
energy: -1238.789783854347
dipole: 11.06326 -10.86138 0.20188 -3.29156 2.61258 -0.67899 -6.37541 5.36489 -1.01052
magnitude: 1.23407 au
magnitude: 3.13675 debye
