program: Orca
programVersion: 5.0.2
elementType: O O O O N N N C C C C C C C C C C C C C C C C C C C C H H H H H H H H H H H H H H H H H H H
charge: 0
multiplicity: 1
keywords: wb97x-d3
keywords: def2-TZVPP
keywords: def2/J RIJCOSX
keywords: DEFGRID2
keywords: scfconv7
keywords: smallprint printgap noloewdin
keywords: NOSOSCF
formula: C20H19N3O4
InChI: InChI=1/C20H19N3O4/c1-14-18(19(23(2)22-14)27-17-6-4-3-5-7-17)12-21-26-13-15-8-10-16(11-9-15)20(24)25/h3-12,24H,13H2,1-2H3
46 atoms
O  1.499337 -0.930348 -0.859726
O  0.56941 0.626155 1.235919
O  -6.46274 1.486313 -0.756709
O  -5.265552 1.438399 -2.634395
N  3.79209 -0.707773 -1.144641
N  4.789355 0.166863 -0.993865
N  0.925071 1.931352 1.058546
C  2.867429 1.043658 -0.189002
C  2.627717 -0.23011 -0.67577
C  4.253332 1.227156 -0.43493
C  5.074973 2.428429 -0.123732
C  4.023243 -1.993224 -1.753165
C  2.006382 2.050558 0.401161
C  -1.857328 0.78248 1.00941
C  1.096922 -1.85536 0.069137
C  -0.66549 0.521395 1.891511
C  -1.763624 0.810993 -0.377474
C  -3.104492 0.957689 1.601317
C  -4.141378 1.174685 -0.555458
C  -2.894532 1.009871 -1.149882
C  -4.238867 1.146733 0.833768
C  1.847966 -2.193098 1.184314
C  -0.13168 -2.453571 -0.168114
C  1.353581 -3.142812 2.066777
C  -0.612337 -3.397008 0.724825
C  0.126156 -3.74826 1.846296
C  -5.314957 1.377628 -1.434316
H  4.704167 3.313557 -0.643597
H  5.07235 2.652684 0.943602
H  6.105084 2.265739 -0.433513
H  3.278508 -2.195383 -2.520552
H  5.007642 -1.966633 -2.208897
H  3.992458 -2.794965 -1.01495
H  2.323867 3.082539 0.295969
H  -0.692991 1.18187 2.764989
H  -0.703321 -0.510353 2.253097
H  -0.807185 0.680606 -0.864066
H  -3.191728 0.948498 2.681738
H  -2.813901 1.038216 -2.228178
H  -5.194732 1.279392 1.320708
H  2.793363 -1.707026 1.387867
H  -0.710759 -2.16708 -1.036038
H  1.937308 -3.403338 2.939772
H  -1.574974 -3.855534 0.541646
H  -0.252225 -4.485016 2.541534
H  -7.173484 1.618285 -1.396918
totalener: -1238.76456642 hartree
nucrepener: 2425.59586844 hartree
electener: -3664.36043486 hartree
oneelecener: -6507.12694582 hartree
twoeener: 2842.76651096 hartree
kineticenergy: 1233.69353036 hartree
xcener: -118.162344881955 hartree
chargesum: -0.0000000
charge: -0.308870 -0.202302 -0.266295 -0.356334 0.145419 -0.297732 -0.147009 -0.055534 0.153543 0.072899 -0.291120 -0.176614 0.012940 0.095346 0.285846 0.064045 -0.183200 -0.162348 -0.081653 -0.122558 -0.135214 -0.159667 -0.252928 -0.127672 -0.090579 -0.149029 0.421077 0.093390 0.106228 0.102765 0.119553 0.120064 0.108298 0.105387 0.108565 0.110075 0.128535 0.109085 0.136153 0.131375 0.134402 0.123468 0.127285 0.128172 0.126014 0.196730
qa: -0.3089 -0.2023 -0.2663 -0.3563 0.1454 -0.2977 -0.1470 -0.0555 0.1535 0.0729 -0.2911 -0.1766 0.0129 0.0953 0.2858 0.0640 -0.1832 -0.1623 -0.0817 -0.1226 -0.1352 -0.1597 -0.2529 -0.1277 -0.0906 -0.1490 0.4211 0.0934 0.1062 0.1028 0.1196 0.1201 0.1083 0.1054 0.1086 0.1101 0.1285 0.1091 0.1362 0.1314 0.1344 0.1235 0.1273 0.1282 0.1260 0.1967
va: 2.0798 1.9684 2.1869 2.1471 3.2818 2.9234 2.9693 3.6203 4.1232 3.9390 3.9435 3.8934 4.0264 3.5989 3.6693 3.8859 3.9490 4.0185 3.7066 4.0624 4.0314 3.8995 4.0123 3.9631 3.9338 3.9565 4.2613 0.9938 0.9903 1.0176 0.9922 1.0124 0.9878 1.0069 1.0179 0.9799 1.0186 1.0104 1.0234 1.0215 1.0046 1.0177 1.0005 0.9990 1.0009 1.0477
dispcorr: -0.025176662 hartree
energy: -1238.789743080484
dipole: 11.38568 -11.11343 0.27225 -4.78951 3.89798 -0.89154 4.98093 -4.15839 0.82254
magnitude: 1.24319 au
magnitude: 3.15995 debye
