program: Orca
programVersion: 5.0.2
elementType: O O O O N N N C C C C C C C C C C C C C C C C C C C C H H H H H H H H H H H H H H H H H H H
charge: 0
multiplicity: 1
keywords: wb97x-d3
keywords: def2-TZVPP
keywords: def2/J RIJCOSX
keywords: DEFGRID2
keywords: scfconv7
keywords: smallprint printgap noloewdin
keywords: NOSOSCF
formula: C20H19N3O4
InChI: InChI=1/C20H19N3O4/c1-14-18(19(23(2)22-14)27-17-6-4-3-5-7-17)12-21-26-13-15-8-10-16(11-9-15)20(24)25/h3-12,24H,13H2,1-2H3
46 atoms
O  1.217215 -0.927065 0.200079
O  0.629046 1.725604 -0.345293
O  -4.728532 -0.837329 3.046735
O  -5.979901 -0.801778 1.203856
N  3.259563 -1.224439 1.180292
N  4.437315 -0.63641 1.412702
N  1.667586 2.422075 -0.882589
C  3.126734 0.721938 0.166239
C  2.439787 -0.451852 0.451232
C  4.382832 0.520657 0.798965
C  5.535423 1.461943 0.833169
C  2.967224 -2.522751 1.732493
C  2.794501 1.911489 -0.588861
C  -1.709849 1.475804 -0.167631
C  0.722813 -1.031913 -1.073711
C  -0.591207 2.158819 -0.896741
C  -2.888767 1.182144 -0.845011
C  -1.600293 1.127074 1.174292
C  -3.815617 0.179057 1.133366
C  -3.933691 0.544614 -0.204942
C  -2.641784 0.480822 1.818763
C  1.479308 -0.822638 -2.216188
C  -0.610293 -1.406349 -1.16264
C  0.879323 -0.981137 -3.458078
C  -1.190842 -1.564347 -2.40881
C  -0.452216 -1.34976 -3.564281
C  -4.953898 -0.525198 1.766658
H  5.264117 2.412422 1.294059
H  6.351936 1.028659 1.406796
H  5.909358 1.680536 -0.168761
H  2.514175 -3.168866 0.983679
H  3.907473 -2.956594 2.057022
H  2.294924 -2.449558 2.587089
H  3.629415 2.494881 -0.962598
H  -0.639229 1.915478 -1.964024
H  -0.68211 3.24787 -0.802709
H  -2.979353 1.432539 -1.894928
H  -0.691104 1.341979 1.718233
H  -4.843156 0.312489 -0.742292
H  -2.531198 0.210083 2.859487
H  2.520995 -0.538763 -2.154461
H  -1.187314 -1.558721 -0.260033
H  1.468664 -0.813579 -4.349807
H  -2.232526 -1.849882 -2.471691
H  -0.909507 -1.472712 -4.536556
H  -5.511605 -1.289763 3.385225
totalener: -1238.76348609 hartree
nucrepener: 2468.55067959 hartree
electener: -3707.31416568 hartree
oneelecener: -6592.93783383 hartree
twoeener: 2885.62366815 hartree
kineticenergy: 1233.70728361 hartree
xcener: -118.167639848919 hartree
chargesum: 0.0000000
charge: -0.306575 -0.200573 -0.264134 -0.354914 0.113499 -0.293044 -0.121257 -0.155776 0.259733 0.086373 -0.291972 -0.172081 -0.008097 0.068564 0.307282 0.056466 -0.156782 -0.154030 -0.093121 -0.114648 -0.127320 -0.173022 -0.232393 -0.132286 -0.106423 -0.143985 0.419952 0.107472 0.103298 0.091097 0.108745 0.116274 0.111754 0.106713 0.095318 0.109608 0.110640 0.119992 0.138676 0.133071 0.131002 0.130619 0.125288 0.128030 0.125780 0.197185
qa: -0.3066 -0.2006 -0.2641 -0.3549 0.1135 -0.2930 -0.1213 -0.1558 0.2597 0.0864 -0.2920 -0.1721 -0.0081 0.0686 0.3073 0.0565 -0.1568 -0.1540 -0.0931 -0.1146 -0.1273 -0.1730 -0.2324 -0.1323 -0.1064 -0.1440 0.4200 0.1075 0.1033 0.0911 0.1087 0.1163 0.1118 0.1067 0.0953 0.1096 0.1106 0.1200 0.1387 0.1331 0.1310 0.1306 0.1253 0.1280 0.1258 0.1972
va: 2.0974 1.9788 2.1897 2.1481 3.3065 2.9241 2.9657 3.6138 4.0363 3.9385 3.9425 3.9088 4.0381 3.5863 3.7016 3.8802 3.9392 3.9567 3.6986 3.9948 3.9875 3.9213 3.9973 3.9870 3.9091 3.9616 4.2618 0.9899 1.0177 0.9935 0.9952 1.0106 0.9880 1.0081 0.9998 1.0054 1.0136 1.0296 1.0200 1.0210 1.0097 1.0095 1.0008 1.0019 1.0001 1.0471
dispcorr: -0.026371337 hartree
energy: -1238.789857426824
dipole: 10.83425 -10.30607 0.52818 -0.40696 0.00959 -0.39737 -3.94165 3.93740 -0.00426
magnitude: 0.66098 au
magnitude: 1.68007 debye
