program: Orca
programVersion: 5.0.2
elementType: O O O O N N N C C C C C C C C C C C C C C C C C C C C H H H H H H H H H H H H H H H H H H H
charge: 0
multiplicity: 1
keywords: wb97x-d3
keywords: def2-TZVPP
keywords: def2/J RIJCOSX
keywords: DEFGRID2
keywords: scfconv7
keywords: smallprint printgap noloewdin
keywords: NOSOSCF
formula: C20H19N3O4
InChI: InChI=1/C20H19N3O4/c1-14-18(19(23(2)22-14)27-17-6-4-3-5-7-17)12-21-26-13-15-8-10-16(11-9-15)20(24)25/h3-12,24H,13H2,1-2H3
46 atoms
O  1.678997 -0.751841 0.858879
O  0.780349 1.834551 0.808291
O  -5.916935 -0.78457 0.513227
O  -5.137079 -0.849034 -1.572524
N  3.672495 -1.199483 -0.251331
N  4.752116 -0.596396 -0.757022
N  1.786508 2.750926 0.833897
C  3.331684 0.946788 0.09089
C  2.791228 -0.318834 0.254201
C  4.572418 0.686472 -0.551495
C  5.594654 1.679014 -0.982822
C  3.544659 -2.633534 -0.308414
C  2.909795 2.277229 0.475055
C  -1.567096 1.592766 0.980587
C  0.630475 -1.199469 0.096449
C  -0.362138 2.349034 1.454268
C  -2.521974 1.149657 1.886264
C  -1.761971 1.352989 -0.37677
C  -3.844176 0.242489 0.097427
C  -3.658847 0.486711 1.453754
C  -2.885367 0.680913 -0.812488
C  0.606233 -1.126609 -1.287947
C  -0.428322 -1.761717 0.794841
C  -0.484694 -1.648059 -1.971486
C  -1.510261 -2.268406 0.09783
C  -1.543356 -2.22318 -1.289519
C  -5.006958 -0.506579 -0.426171
H  6.430275 1.168566 -1.457017
H  5.18596 2.394722 -1.697205
H  5.986083 2.248367 -0.138024
H  3.126924 -3.015484 0.620651
H  2.904774 -2.945894 -1.134111
H  4.538375 -3.04712 -0.449567
H  3.684777 3.036272 0.453957
H  -0.469148 3.413598 1.218942
H  -0.262261 2.265739 2.542879
H  -2.376014 1.319221 2.946195
H  -1.022902 1.679347 -1.09564
H  -4.387507 0.151762 2.178563
H  -3.024334 0.48523 -1.866414
H  1.414555 -0.662204 -1.838377
H  -0.400527 -1.791543 1.875895
H  -0.503351 -1.591324 -3.052001
H  -2.338227 -2.697658 0.646049
H  -2.396997 -2.610435 -1.828605
H  -6.63579 -1.275271 0.095008
totalener: -1238.76188334 hartree
nucrepener: 2494.77790978 hartree
electener: -3733.53979312 hartree
oneelecener: -6645.69122996 hartree
twoeener: 2912.15143684 hartree
kineticenergy: 1233.72112913 hartree
xcener: -118.169683369944 hartree
chargesum: -0.0000000
charge: -0.285436 -0.196950 -0.265633 -0.360554 0.134180 -0.291547 -0.142677 -0.084585 0.155009 0.076722 -0.293829 -0.180328 0.019382 0.003341 0.321380 0.097320 -0.138227 -0.121408 -0.102436 -0.119667 -0.099615 -0.239727 -0.259804 -0.100075 -0.032064 -0.179295 0.422425 0.102485 0.104964 0.092824 0.119912 0.111633 0.121473 0.100230 0.094517 0.076921 0.109191 0.122213 0.130213 0.136606 0.140809 0.116973 0.130243 0.122697 0.132812 0.197385
qa: -0.2854 -0.1969 -0.2656 -0.3606 0.1342 -0.2915 -0.1427 -0.0846 0.1550 0.0767 -0.2938 -0.1803 0.0194 0.0033 0.3214 0.0973 -0.1382 -0.1214 -0.1024 -0.1197 -0.0996 -0.2397 -0.2598 -0.1001 -0.0321 -0.1793 0.4224 0.1025 0.1050 0.0928 0.1199 0.1116 0.1215 0.1002 0.0945 0.0769 0.1092 0.1222 0.1302 0.1366 0.1408 0.1170 0.1302 0.1227 0.1328 0.1974
va: 2.1064 1.9903 2.1906 2.1357 3.2807 2.9183 2.9892 3.5775 4.1735 3.9249 3.9478 3.8980 4.0427 3.7084 3.6075 3.8683 3.9584 3.9042 3.6799 4.0048 3.8985 3.8879 4.0327 3.9087 3.8199 3.9249 4.2437 1.0179 0.9906 0.9926 0.9915 0.9853 1.0123 1.0078 1.0072 1.0024 1.0122 1.0227 1.0214 1.0210 1.0026 1.0211 0.9978 0.9987 1.0074 1.0472
dispcorr: -0.028080824 hartree
energy: -1238.789964161234
dipole: 8.99985 -9.09027 -0.09042 -1.39405 0.86410 -0.52995 -1.91591 2.44801 0.53210
magnitude: 0.75641 au
magnitude: 1.92263 debye
