program: Orca
programVersion: 5.0.2
elementType: O O O O N N N C C C C C C C C C C C C C C C C C C C C H H H H H H H H H H H H H H H H H H H
charge: 0
multiplicity: 1
keywords: wb97x-d3
keywords: def2-TZVPP
keywords: def2/J RIJCOSX
keywords: DEFGRID2
keywords: scfconv7
keywords: smallprint printgap noloewdin
keywords: NOSOSCF
formula: C20H19N3O4
InChI: InChI=1/C20H19N3O4/c1-14-18(19(23(2)22-14)27-17-6-4-3-5-7-17)12-21-26-13-15-8-10-16(11-9-15)20(24)25/h3-12,24H,13H2,1-2H3
46 atoms
O  1.929086 -1.911857 0.703057
O  1.177242 2.7171 0.841589
O  -4.884465 -0.803698 0.510817
O  -4.493205 -0.571666 -1.669268
N  3.384043 -0.947087 -0.867864
N  3.962364 0.223357 -1.148889
N  1.243003 1.96419 1.98248
C  2.65924 0.440864 0.674898
C  2.605218 -0.857656 0.219986
C  3.540402 1.074763 -0.237792
C  4.035116 2.477095 -0.226496
C  3.560155 -2.082301 -1.734568
C  1.954957 0.921417 1.8527
C  -1.196458 2.542211 0.499208
C  0.710546 -2.223364 0.141952
C  -0.037672 3.441988 0.831599
C  -1.589335 2.353611 -0.822405
C  -1.841071 1.822609 1.499552
C  -3.223303 0.72843 -0.135711
C  -2.593413 1.457847 -1.140191
C  -2.846662 0.923224 1.189515
C  0.159837 -3.437618 0.526178
C  0.053895 -1.394276 -0.754776
C  -1.06185 -3.825178 0.001556
C  -1.163564 -1.805819 -1.280353
C  -1.727115 -3.015517 -0.908991
C  -4.24887 -0.264358 -0.531065
H  4.906157 2.569481 -0.872001
H  3.271702 3.17079 -0.575646
H  4.315105 2.789541 0.779259
H  4.520596 -1.981666 -2.231048
H  3.5518 -3.002795 -1.155611
H  2.771896 -2.132236 -2.486397
H  1.993702 0.318056 2.753828
H  0.088651 4.209819 0.066604
H  -0.189092 3.938678 1.794539
H  -1.099626 2.909624 -1.612936
H  -1.539786 1.954518 2.530471
H  -2.891455 1.315189 -2.170378
H  -3.323236 0.364839 1.982726
H  0.687059 -4.066493 1.23164
H  0.462135 -0.430828 -1.032957
H  -1.491687 -4.77123 0.303386
H  -1.675761 -1.16819 -1.987104
H  -2.67721 -3.319574 -1.326515
H  -5.51751 -1.450496 0.174171
totalener: -1238.76229694 hartree
nucrepener: 2494.09043038 hartree
electener: -3732.85272732 hartree
oneelecener: -6644.23958842 hartree
twoeener: 2911.38686110 hartree
kineticenergy: 1233.70393236 hartree
xcener: -118.158131521646 hartree
chargesum: -0.0000000
charge: -0.309583 -0.202581 -0.260738 -0.362227 0.111217 -0.282225 -0.119751 -0.097947 0.176492 0.084638 -0.259829 -0.179159 -0.019256 -0.022678 0.266084 0.095441 -0.134670 -0.109019 -0.043584 -0.164774 -0.122826 -0.221251 -0.144336 -0.073971 -0.183233 -0.159670 0.416726 0.101179 0.093049 0.096391 0.121640 0.116092 0.112776 0.120414 0.084387 0.095451 0.114352 0.120249 0.143808 0.130256 0.123727 0.136793 0.124790 0.156508 0.134144 0.196704
qa: -0.3096 -0.2026 -0.2607 -0.3622 0.1112 -0.2822 -0.1198 -0.0979 0.1765 0.0846 -0.2598 -0.1792 -0.0193 -0.0227 0.2661 0.0954 -0.1347 -0.1090 -0.0436 -0.1648 -0.1228 -0.2213 -0.1443 -0.0740 -0.1832 -0.1597 0.4167 0.1012 0.0930 0.0964 0.1216 0.1161 0.1128 0.1204 0.0844 0.0955 0.1144 0.1202 0.1438 0.1303 0.1237 0.1368 0.1248 0.1565 0.1341 0.1967
va: 2.1095 1.9720 2.1984 2.1263 3.3024 2.9187 2.9074 3.6153 4.0954 4.0056 3.9357 3.8978 4.0218 3.7072 3.7633 3.8698 3.9470 3.9288 3.6452 3.9626 4.0185 4.0388 3.8273 3.9393 3.9522 3.9535 4.2327 1.0147 1.0054 0.9983 1.0095 0.9934 0.9856 1.0097 0.9993 1.0130 1.0108 1.0278 1.0196 1.0213 1.0160 1.0098 0.9980 0.9930 1.0050 1.0484
dispcorr: -0.026919062 hartree
energy: -1238.789215998944
dipole: 5.77784 -6.04971 -0.27187 1.10059 -1.70187 -0.60128 -3.48402 3.75825 0.27423
magnitude: 0.71460 au
magnitude: 1.81636 debye
