program: Gaussian 09
title: 000054744
version: EM64L-G09RevD.01
frameworkgroup: C1[X(C16H20N2O3)]
method: RPBEPBE
basis: SDD
operation: Freq
keyword: #p
keyword: freq=noraman
keyword: PBEPBE/SDD
title: #p freq=noraman PBEPBE/SDD
converged: YES YES NO NO
title: Mulliken charges:
elementType: O O O N N C C C C C C C C C C C C C C C C H H H H H H H H H H H H H H H H H H H H
charge: -0.210650 -0.281722 -0.307138 -0.133051 -0.455913 0.102865 -0.051909 0.062287 -0.739424 -0.732671 -0.739028 0.087885 0.235732 0.124193 -0.527063 0.469228 -0.319769 -0.387290 0.194720 -0.805508 -0.493947 0.221962 0.230711 0.237553 0.226161 0.238410 0.221708 0.212790 0.234896 0.209233 0.220613 0.396005 0.299558 0.276336 0.242028 0.227510 0.238409 0.242302 0.248962 0.246800 0.236222
chargesum: 0.00000
title: Mulliken charges with hydrogens summed into heavy atoms:
elementType: O O O N N C C C C C C C C C C C C C C C C
charge: -0.210650 -0.281722 -0.307138 -0.133051 -0.059908 0.102865 0.170053 0.062287 -0.044998 -0.059763 -0.074286 0.087885 0.235732 0.124193 -0.227505 0.469228 -0.043433 -0.145261 0.194720 -0.097286 0.238037
polarizability: 2.63094006e+02 4.97518540e+00 2.38558602e+02 6.01989803e+00 -2.06379559e+00 1.22650336e+02
1716.lowfreq: -19.1504 -3.0037 -0.0008 -0.0005 0.0006 4.3639 7.2675 20.2937 45.2989
frequency: -18.5119 18.4576 45.2799 58.9408 63.2199 70.6979 101.2697 106.4276 128.7935 146.2583 158.9231 166.6743 190.6304 198.1522 206.4016 213.0673 235.4349 241.2422 275.7604 290.2848 310.7669 320.1175 331.0207 351.1463 370.1188 392.9852 412.5314 444.1384 483.8067 520.8657 566.7256 581.4762 596.6857 637.9525 663.1108 677.3799 696.5218 713.9684 735.1922 766.2044 774.6682 818.9055 846.2091 853.6679 896.6345 917.6193 918.3955 934.1627 950.6649 951.0148 957.0830 959.9718 992.9749 1003.9365 1043.9791 1050.6640 1053.6193 1085.6005 1096.0798 1111.5706 1113.1788 1145.5485 1149.5726 1162.9845 1172.7372 1198.0110 1213.0971 1221.5144 1233.9025 1271.6525 1295.6620 1311.8332 1317.1703 1371.4428 1373.3782 1377.3426 1379.6686 1393.2077 1397.4861 1423.3201 1431.5764 1450.8114 1458.0752 1461.8006 1467.1024 1467.7498 1471.4532 1472.8182 1479.6428 1480.5420 1485.1250 1496.1290 1521.5709 1559.4030 1600.1340 1618.0895 1668.6274 2978.8439 2979.3907 2982.2227 2984.8861 2994.0321 3009.7511 3061.6011 3071.5331 3076.7346 3078.0375 3086.3017 3090.3864 3094.6190 3111.2757 3114.2440 3136.3826 3148.6097 3154.3840 3187.8473 3273.0424
redmass: 1.0115 4.4040 4.3636 4.0583 2.6919 3.4031 1.2123 4.2001 4.4766 3.4936 4.2321 3.6285 1.3872 2.1099 1.5848 3.5079 1.1572 4.2528 2.6845 3.7959 3.3126 4.7929 2.8314 4.7435 3.2543 3.8085 3.2867 3.2415 3.6693 4.8197 3.8745 5.2804 4.5034 4.6052 7.5484 4.9607 6.3535 5.4030 6.3695 5.6155 4.5554 5.0541 1.4249 2.5499 3.2822 3.1435 1.3426 2.4493 1.2400 1.2313 1.8383 1.8736 1.3684 1.5297 1.6398 1.9529 3.0556 2.9821 3.0081 2.7512 1.2623 1.8026 2.1057 1.5438 2.1442 2.7736 3.6837 4.7511 2.6378 1.6164 1.9593 1.4862 1.3685 1.5100 2.6494 1.5595 1.7513 1.2047 1.2194 1.2600 2.9507 1.0497 1.0597 1.0534 1.0683 1.1532 1.0567 1.0698 2.5273 1.0573 1.0986 1.0510 4.6992 6.4959 7.3133 6.4051 9.4922 1.0351 1.0393 1.0410 1.0777 1.0346 1.0293 1.0943 1.0995 1.0990 1.1000 1.1000 1.0997 1.1001 1.1004 1.1048 1.0908 1.0917 1.1053 1.0937 1.0874
irintensity: 0.5156 0.5239 0.4355 0.3779 0.0552 1.6979 0.1429 1.1314 1.3238 5.1032 0.6737 2.0174 2.8878 4.8421 0.8805 2.2047 0.1453 0.1346 7.1634 2.9130 3.1480 2.5417 4.6521 21.3266 0.9581 3.0679 7.3466 4.8079 3.6763 5.3719 9.0306 2.9572 4.4468 31.4820 1.5563 2.3117 15.6106 20.9461 10.4312 1.4642 2.1325 4.6977 28.0677 8.1299 20.7900 2.4885 2.1924 10.2427 47.0960 69.2922 1.2348 2.3575 3.0710 7.2253 17.4986 43.6228 167.2769 10.4348 6.7032 55.2721 0.1916 34.9513 48.0778 6.9113 4.4706 28.8409 53.4613 69.0087 250.4686 1.4904 2.3056 12.4925 11.5302 3.1517 25.8983 45.0206 45.5944 19.2569 16.6050 88.1805 196.3091 15.3838 10.6871 13.3715 7.6946 16.9847 2.7728 14.8268 119.5109 22.2719 11.2806 9.8805 77.8835 56.0919 232.9978 33.2896 281.1179 26.4161 19.6255 28.0938 16.0942 25.0468 36.0137 18.3149 13.1299 60.0425 22.4241 31.5366 42.7987 13.4583 13.0244 21.0385 13.5515 6.2901 17.0550 3.7734 642.5889
temp: 298.150 k
press: 1.00000 atm
elementType: 8 8 8 7 7 6 6 6 6 6 6 6 6 6 6 6 6 6 6 6 6 1 1 1 1 1 1 1 1 1 1 1 1 1 1 1 1 1 1 1 1
symmnumber: 1
zpe: 869885.7 jmol-1
zpe.correction: 0.331322 hartree
zpe.thermalcorrener: 0.352250 hartree
zpe.thermalcorrenthalpy: 0.353194 hartree
zpe.thermalcorrgfe: 0.281105 hartree
zpe.sumelectzpe: -955.347853 hartree
zpe.sumelectthermal: -955.326925 hartree
zpe.sumelectthermalent: -955.325981 hartree
zpe.sumelectthermalfe: -955.398070 hartree
dipole: 5.1910 3.2826 -0.0796
dipole: 6.1424
quadrupole: -108.6865 -121.1078 -125.3490
quadrupole: -12.6702 1.5942 2.8243
quadrupole: 9.6946 -2.7267 -6.9679 -12.6702 1.5942 2.8243
hfenergy: -955.6791748 hartree
pointgroup: C01 [X(C16H20N2O3)]
dipole: 2.3797727 -0.0254579 -0.4194359 debye
polarizability: 261.7253226|-12.7726254|171.4003853|-2.3629999|-57.1745119|191.1772363 unknown
InChI: InChI=1S/C16H20N2O3/c1-9(2)16(4)15(20)17-13(18-16)12-8-10(3)6-7-11(12)14(19)21-5/h6-9,17H,1-5H3
charge 0 multiplicity 1
41 atoms
O  -3.688009 -0.908196 1.372106
O  2.587733 -2.743577 2.036238
O  0.45257 -1.966507 2.37129
N  -1.33154 0.24297 -1.166115
N  -1.363534 -0.800321 0.876261
C  -2.767934 0.094004 -0.769983
C  -3.479193 1.490253 -0.666585
C  -2.728196 -0.592553 0.624922
C  -3.476964 -0.857184 -1.767684
C  -2.780517 2.409735 0.363518
C  -3.582122 2.191852 -2.039908
C  -0.599641 -0.292831 -0.194596
C  0.897088 -0.303284 -0.272529
C  1.844914 -1.029138 0.536781
C  1.406165 0.501324 -1.33056
C  2.779879 0.634621 -1.618188
C  3.23321 -0.900362 0.229866
C  3.697817 -0.089052 -0.814059
C  1.520452 -1.91544 1.697053
C  3.259074 1.537841 -2.736961
C  2.368587 -3.626161 3.208386
H  -4.499688 1.264919 -0.293301
H  -4.53819 -0.969351 -1.483694
H  -3.40654 -0.459509 -2.792587
H  -3.005749 -1.855791 -1.755758
H  -2.745445 1.94946 1.367486
H  -1.746833 2.639499 0.045765
H  -3.329737 3.36447 0.454069
H  -2.579152 2.307177 -2.488702
H  -4.026225 3.197098 -1.917887
H  -4.216689 1.633183 -2.75026
H  -0.9318 -1.260094 1.698686
H  0.660919 1.022269 -1.94003
H  3.945228 -1.46069 0.83926
H  4.774127 -0.016363 -1.007734
H  4.166783 1.136385 -3.220888
H  2.483415 1.672108 -3.509663
H  3.51342 2.542676 -2.346925
H  1.516498 -4.300038 3.02173
H  2.162721 -3.022678 4.107865
H  3.307396 -4.187923 3.308913
