program: Orca
programVersion: 5.0.2
elementType: F F F F F F O O N N N N C C C C C C C C C C C C C C C C C C C C C C C C H H H H H H H H H H H H H H H H
charge: 0
multiplicity: 1
keywords: wb97x-d3
keywords: def2-TZVPP
keywords: def2/J RIJCOSX
keywords: DEFGRID2
keywords: scfconv7
keywords: smallprint printgap noloewdin
keywords: NOSOSCF
formula: C24H16F6N4O2
InChI: InChI=1/C24H16F6N4O2/c25-23(26,27)18-3-1-2-17(13-18)21(12-15-4-6-16(14-31)7-5-15)33-34-22(35)32-19-8-10-20(11-9-19)36-24(28,29)30/h1-11,13,32,34H,12H2
52 atoms
F  7.102012 -4.332756 -0.924609
F  6.776494 -2.437941 -1.8897
F  5.481831 -4.095634 -2.314916
F  -8.311007 2.047561 -0.484996
F  -7.204627 0.371809 -1.261477
F  -6.483388 2.361977 -1.575135
O  -6.464509 1.527021 0.491902
O  -1.342503 -2.623799 0.968094
N  1.339639 -0.495173 0.508771
N  0.665025 -1.627394 0.752432
N  -1.230214 -0.350631 0.655485
N  -1.667478 5.684162 -0.057489
C  3.227956 0.884404 0.096841
C  2.606664 -0.452668 0.409663
C  3.515252 -1.60685 0.601705
C  2.209698 1.982954 0.036292
C  4.392976 -1.988147 -0.406427
C  5.248368 -3.066615 -0.212985
C  3.515755 -2.303839 1.809743
C  1.509996 2.237749 -1.140731
C  1.90137 2.717377 1.17771
C  5.238338 -3.764527 0.987119
C  4.372539 -3.374773 1.997027
C  6.154611 -3.483273 -1.329751
C  0.514825 3.196514 -1.181057
C  0.909877 3.681791 1.155945
C  0.210903 3.917663 -0.026339
C  -2.565776 0.036529 0.621505
C  -0.705575 -1.593668 0.79883
C  -3.653972 -0.813413 0.823384
C  -2.806568 1.391431 0.374253
C  -5.158874 1.028609 0.502081
C  -4.945942 -0.31157 0.759401
C  -4.093023 1.890973 0.314328
C  -0.827543 4.892552 -0.048135
C  -7.093826 1.571473 -0.692055
H  3.983035 1.101512 0.856754
H  3.766749 0.807403 -0.852534
H  4.396066 -1.441571 -1.341485
H  2.855918 -2.000511 2.612573
H  1.740399 1.673239 -2.035252
H  2.437719 2.528604 2.098883
H  5.898109 -4.604468 1.153308
H  4.370454 -3.908876 2.936804
H  -0.029226 3.383889 -2.096815
H  0.673592 4.245148 2.048445
H  1.111584 -2.537577 0.797649
H  -0.551587 0.386831 0.50407
H  -3.519206 -1.861659 1.030242
H  -1.972214 2.066694 0.226084
H  -5.781435 -0.978401 0.927305
H  -4.252223 2.946208 0.136888
elementType: F O N C H
totalener: -1892.95545266 hartree
nucrepener: 3651.78334786 hartree
electener: -5544.73880052 hartree
oneelecener: -9856.68065099 hartree
twoeener: 4311.94185047 hartree
cpcmener: -0.05392762 hartree
kineticenergy: 1885.77787624 hartree
xcener: -170.265208280217 hartree
chargesum: -0.0000000
charge: -0.181130 -0.184094 -0.183457 -0.167482 -0.174747 -0.175323 -0.316495 -0.563386 -0.235334 -0.084643 -0.161813 -0.127926 -0.082028 0.249704 -0.014436 0.047129 -0.168730 -0.083862 -0.194568 -0.161540 -0.160856 -0.106187 -0.160145 0.550865 -0.180778 -0.160879 0.166119 0.135622 0.435092 -0.196309 -0.125928 0.207631 -0.162236 -0.188182 -0.102827 0.590249 0.116213 0.119178 0.147803 0.164645 0.146534 0.145865 0.153990 0.164179 0.154512 0.155797 0.176226 0.191712 0.153829 0.129292 0.155294 0.147845
qa: -0.1811 -0.1841 -0.1835 -0.1675 -0.1747 -0.1753 -0.3165 -0.5634 -0.2353 -0.0846 -0.1618 -0.1279 -0.0820 0.2497 -0.0144 0.0471 -0.1687 -0.0839 -0.1946 -0.1615 -0.1609 -0.1062 -0.1601 0.5509 -0.1808 -0.1609 0.1661 0.1356 0.4351 -0.1963 -0.1259 0.2076 -0.1622 -0.1882 -0.1028 0.5902 0.1162 0.1192 0.1478 0.1646 0.1465 0.1459 0.1540 0.1642 0.1545 0.1558 0.1762 0.1917 0.1538 0.1293 0.1553 0.1478
va: 1.1219 1.1147 1.1072 1.1374 1.1241 1.1237 2.0739 1.9430 2.9723 3.1868 3.2130 3.1212 3.8626 3.7578 3.6279 3.6405 4.0532 3.7426 3.9471 3.9141 3.9487 3.9242 3.9383 4.4370 3.9546 3.9747 3.5872 3.9041 4.3300 3.9346 3.8561 3.7212 4.0570 4.0793 3.9989 4.6154 1.0046 1.0030 1.0206 0.9994 0.9999 1.0008 1.0043 0.9900 1.0048 1.0030 1.0275 1.0188 1.0341 1.0136 1.0006 1.0098
dispcorr: -0.027621022 hartree
energy: -1892.983073682175
dipole: 16.66720 -11.92565 4.74155 7.45113 -8.30324 -0.85211 16.54932 -15.49925 1.05007
magnitude: 4.93062 au
magnitude: 12.53265 debye
