program: Orca
programVersion: 5.0.2
elementType: F F F F F F O O N N N N C C C C C C C C C C C C C C C C C C C C C C C C H H H H H H H H H H H H H H H H
charge: 0
multiplicity: 1
keywords: wb97x-d3
keywords: def2-TZVPP
keywords: def2/J RIJCOSX
keywords: DEFGRID2
keywords: scfconv7
keywords: smallprint printgap noloewdin
keywords: NOSOSCF
formula: C24H16F6N4O2
InChI: InChI=1/C24H16F6N4O2/c25-23(26,27)18-3-1-2-17(13-18)21(12-15-4-6-16(14-31)7-5-15)33-34-22(35)32-19-8-10-20(11-9-19)36-24(28,29)30/h1-11,13,32,34H,12H2
52 atoms
F  7.071103 -4.048544 1.201633
F  5.251007 -4.217446 2.332242
F  6.295396 -2.342573 2.256234
F  -6.079458 2.438468 1.914172
F  -6.9211 0.47173 1.844391
F  -8.067278 2.151631 1.131015
O  -6.414216 1.484195 -0.073443
O  -1.330732 -2.728472 -0.708979
N  1.324166 -0.518714 -0.716985
N  0.66767 -1.685795 -0.787011
N  -1.236895 -0.43084 -0.715948
N  -1.86618 5.524624 -0.194505
C  3.20487 0.927324 -0.561333
C  2.591732 -0.444486 -0.671806
C  3.50593 -1.608901 -0.730073
C  2.167846 2.006973 -0.47834
C  4.29555 -1.928411 0.369079
C  5.147174 -3.023718 0.313908
C  3.580628 -2.387053 -1.882967
C  1.694979 2.623401 -1.633506
C  1.609371 2.353062 0.749795
C  5.219502 -3.800059 -0.836466
C  4.437398 -3.474797 -1.933261
C  5.944847 -3.403707 1.522177
C  0.674469 3.555777 -1.574323
C  0.588306 3.281539 0.82837
C  0.114796 3.879746 -0.339282
C  -2.5628 -0.03932 -0.5730
C  -0.70411 -1.678527 -0.730542
C  -2.785769 1.33893 -0.497769
C  -3.654705 -0.904291 -0.502893
C  -5.123125 0.97283 -0.22959
C  -4.0565 1.848986 -0.324372
C  -4.932314 -0.391295 -0.32805
C  -0.973068 4.796937 -0.266424
C  -6.85222 1.630019 1.18569
H  3.854056 0.946868 0.319355
H  3.860027 1.083931 -1.422786
H  4.230403 -1.318564 1.261618
H  2.97723 -2.135223 -2.746063
H  2.122471 2.364303 -2.593793
H  1.968653 1.880884 1.655498
H  5.877943 -4.656235 -0.892322
H  4.497511 -4.072804 -2.832013
H  0.305384 4.022655 -2.477395
H  0.15095 3.535614 1.784454
H  1.136954 -2.584895 -0.753045
H  -0.556711 0.320362 -0.725325
H  -1.947392 2.021211 -0.566605
H  -3.533148 -1.972065 -0.576676
H  -4.206581 2.919616 -0.271508
H  -5.773897 -1.069789 -0.279839
elementType: F O N C H
totalener: -1892.95520350 hartree
nucrepener: 3669.60964206 hartree
electener: -5562.56484556 hartree
oneelecener: -9892.44833911 hartree
twoeener: 4329.88349355 hartree
cpcmener: -0.05406990 hartree
kineticenergy: 1885.78070376 hartree
xcener: -170.264919786646 hartree
chargesum: 0.0000000
charge: -0.182417 -0.182673 -0.182679 -0.175342 -0.175349 -0.166841 -0.316069 -0.562419 -0.232207 -0.083278 -0.164051 -0.128314 -0.079657 0.240719 -0.046389 0.053140 -0.144064 -0.078736 -0.174301 -0.167776 -0.160617 -0.116765 -0.160066 0.547421 -0.154544 -0.173113 0.155158 0.134301 0.433878 -0.124597 -0.195438 0.204864 -0.189401 -0.160795 -0.099711 0.590336 0.120227 0.116063 0.146903 0.160816 0.146103 0.146798 0.152669 0.163998 0.154673 0.155027 0.174301 0.191817 0.132457 0.153884 0.147054 0.155001
qa: -0.1824 -0.1827 -0.1827 -0.1753 -0.1753 -0.1668 -0.3161 -0.5624 -0.2322 -0.0833 -0.1641 -0.1283 -0.0797 0.2407 -0.0464 0.0531 -0.1441 -0.0787 -0.1743 -0.1678 -0.1606 -0.1168 -0.1601 0.5474 -0.1545 -0.1731 0.1552 0.1343 0.4339 -0.1246 -0.1954 0.2049 -0.1894 -0.1608 -0.0997 0.5903 0.1202 0.1161 0.1469 0.1608 0.1461 0.1468 0.1527 0.1640 0.1547 0.1550 0.1743 0.1918 0.1325 0.1539 0.1471 0.1550
va: 1.1187 1.1050 1.1183 1.1233 1.1235 1.1385 2.0748 1.9449 2.9744 3.1846 3.2097 3.1167 3.8612 3.7652 3.6532 3.6315 4.0131 3.7287 3.9454 3.9379 3.9243 3.9454 3.9291 4.4356 3.9537 3.9588 3.6062 3.9115 4.3310 3.8420 3.9368 3.7344 4.0773 4.0565 3.9943 4.6136 1.0038 1.0057 1.0212 0.9997 1.0009 0.9992 1.0049 0.9896 1.0033 1.0040 1.0284 1.0202 1.0138 1.0339 1.0110 1.0014
dispcorr: -0.028016577 hartree
energy: -1892.983220075593
dipole: 16.43622 -11.57678 4.85943 6.52850 -7.27068 -0.74218 -21.02003 19.40765 -1.61238
magnitude: 5.17346 au
magnitude: 13.14989 debye
