program: Orca
programVersion: 5.0.2
elementType: F F F F F F O O N N N N C C C C C C C C C C C C C C C C C C C C C C C C H H H H H H H H H H H H H H H H
charge: 0
multiplicity: 1
keywords: wb97x-d3
keywords: def2-TZVPP
keywords: def2/J RIJCOSX
keywords: DEFGRID2
keywords: scfconv7
keywords: smallprint printgap noloewdin
keywords: NOSOSCF
formula: C24H16F6N4O2
InChI: InChI=1/C24H16F6N4O2/c25-23(26,27)18-3-1-2-17(13-18)21(12-15-4-6-16(14-31)7-5-15)33-34-22(35)32-19-8-10-20(11-9-19)36-24(28,29)30/h1-11,13,32,34H,12H2
52 atoms
F  4.885829 -4.093751 0.608536
F  6.031692 -2.442902 1.367353
F  6.537463 -3.321705 -0.529296
F  -8.247519 -0.176806 1.717644
F  -8.370252 -1.612531 0.133648
F  -9.786993 0.008276 0.2233
O  -7.767992 0.475582 -0.358112
O  -1.791324 -1.807495 -1.879157
N  0.321641 -0.072703 0.254113
N  -0.096363 -0.876075 -0.739716
N  -2.244331 -0.197732 -0.307563
N  6.446758 5.657551 -0.46101
C  1.970048 0.909644 1.665742
C  1.565999 0.050221 0.502049
C  2.654902 -0.57268 -0.288969
C  2.948697 1.969438 1.237648
C  3.541973 -1.456736 0.311429
C  4.584504 -2.004224 -0.427615
C  2.830743 -0.227003 -1.628529
C  2.513002 3.054655 0.479608
C  4.300428 1.858368 1.548448
C  4.752554 -1.665793 -1.762867
C  3.874182 -0.771622 -2.356647
C  5.51264 -2.964395 0.247757
C  3.405458 4.014672 0.041014
C  5.207745 2.809478 1.116526
C  4.758183 3.88968 0.359636
C  -3.631545 -0.092615 -0.371039
C  -1.42884 -1.009542 -1.025468
C  -4.439061 -0.747919 -1.302211
C  -4.23359 0.755119 0.563093
C  -6.386798 0.265913 -0.337028
C  -5.813939 -0.567386 -1.277123
C  -5.603354 0.938071 0.584151
C  5.687079 4.870355 -0.093482
C  -8.519316 -0.318561 0.419302
H  1.076903 1.36059 2.099626
H  2.426772 0.280481 2.434761
H  3.40973 -1.713772 1.35598
H  2.159903 0.481294 -2.09811
H  1.463762 3.149059 0.228534
H  4.648792 1.017002 2.133978
H  5.560547 -2.079621 -2.349516
H  4.010125 -0.496538 -3.393355
H  3.061142 4.855988 -0.545115
H  6.256841 2.716683 1.362416
H  0.538335 -1.483414 -1.247976
H  -1.786218 0.384574 0.381924
H  -4.019648 -1.396402 -2.052393
H  -3.621495 1.280961 1.285814
H  -6.428291 -1.072604 -2.010862
H  -6.045327 1.610145 1.307594
elementType: F O N C H
totalener: -1892.95637591 hartree
nucrepener: 3552.85733030 hartree
electener: -5445.81370621 hartree
oneelecener: -9658.42342682 hartree
twoeener: 4212.60972061 hartree
cpcmener: -0.05382741 hartree
kineticenergy: 1885.77018131 hartree
xcener: -170.260507375084 hartree
chargesum: -0.0000000
charge: -0.184152 -0.183458 -0.180470 -0.175732 -0.174947 -0.167509 -0.315837 -0.564403 -0.251893 -0.035582 -0.158094 -0.131693 -0.068495 0.212769 -0.004048 0.026954 -0.217592 -0.040913 -0.197403 -0.171071 -0.155503 -0.114048 -0.147722 0.553864 -0.179342 -0.179809 0.183910 0.203889 0.434430 -0.236535 -0.225216 0.174453 -0.140128 -0.127581 -0.101823 0.590811 0.111929 0.121450 0.142970 0.162682 0.148419 0.148974 0.155997 0.165123 0.159060 0.157199 0.177305 0.181839 0.159270 0.144926 0.155878 0.156898
qa: -0.1842 -0.1835 -0.1805 -0.1757 -0.1749 -0.1675 -0.3158 -0.5644 -0.2519 -0.0356 -0.1581 -0.1317 -0.0685 0.2128 -0.0040 0.0270 -0.2176 -0.0409 -0.1974 -0.1711 -0.1555 -0.1140 -0.1477 0.5539 -0.1793 -0.1798 0.1839 0.2039 0.4344 -0.2365 -0.2252 0.1745 -0.1401 -0.1276 -0.1018 0.5908 0.1119 0.1214 0.1430 0.1627 0.1484 0.1490 0.1560 0.1651 0.1591 0.1572 0.1773 0.1818 0.1593 0.1449 0.1559 0.1569
va: 1.1099 1.1129 1.1235 1.1233 1.1241 1.1375 2.0739 1.9382 2.9964 3.1577 3.2148 3.1234 3.8243 3.7429 3.6142 3.6387 4.0448 3.7007 3.9433 3.9370 3.9189 3.9300 3.9320 4.4351 3.9921 4.0121 3.6001 3.8082 4.3261 3.9643 3.9630 3.7435 4.0371 4.0106 4.0082 4.6142 1.0219 1.0031 1.0252 1.0012 1.0052 1.0014 1.0036 0.9890 1.0019 1.0031 1.0269 1.0285 1.0324 1.0049 1.0000 0.9986
dispcorr: -0.025690853 hartree
energy: -1892.982066761992
dipole: 20.23814 -19.38748 0.85066 19.40225 -19.27387 0.12838 -4.16932 5.39751 1.22819
magnitude: 1.49952 au
magnitude: 3.81147 debye
