program: Orca
programVersion: 5.0.2
elementType: F F F F F F O O N N N N C C C C C C C C C C C C C C C C C C C C C C C C H H H H H H H H H H H H H H H H
charge: 0
multiplicity: 1
keywords: wb97x-d3
keywords: def2-TZVPP
keywords: def2/J RIJCOSX
keywords: DEFGRID2
keywords: scfconv7
keywords: smallprint printgap noloewdin
keywords: NOSOSCF
formula: C24H16F6N4O2
InChI: InChI=1/C24H16F6N4O2/c25-23(26,27)18-3-1-2-17(13-18)21(12-15-4-6-16(14-31)7-5-15)33-34-22(35)32-19-8-10-20(11-9-19)36-24(28,29)30/h1-11,13,32,34H,12H2
52 atoms
F  5.761444 -3.211474 1.281337
F  3.795046 -2.917899 2.101828
F  5.20677 -1.297213 2.094348
F  -9.660739 -0.221647 0.445444
F  -8.279033 -1.714213 -0.26436
F  -8.351481 0.206098 -1.210443
O  -7.573073 0.066885 0.871223
O  -1.523226 -2.444059 0.410786
N  0.376313 0.173331 -0.837327
N  0.049858 -1.032778 -0.346396
N  -2.105474 -0.283331 -0.095644
N  7.050847 4.798372 1.471369
C  1.850243 1.759046 -1.829402
C  1.556814 0.403795 -1.252834
C  2.67383 -0.5721 -1.212061
C  2.993112 2.428719 -1.112501
C  3.185353 -1.000423 0.006076
C  4.245723 -1.899898 0.038132
C  3.236223 -1.044588 -2.396532
C  4.256546 2.500822 -1.69143
C  2.801061 2.963963 0.160152
C  4.799349 -2.37445 -1.141271
C  4.288519 -1.942492 -2.357811
C  4.759132 -2.336072 1.374729
C  5.309662 3.105091 -1.026772
C  3.841292 3.573622 0.836852
C  5.100304 3.646696 0.239855
C  -3.474232 -0.274511 0.160667
C  -1.240791 -1.324428 0.018563
C  -4.184933 0.851124 -0.266487
C  -4.163176 -1.289174 0.82799
C  -6.212762 -0.061684 0.598157
C  -5.545967 0.962477 -0.050974
C  -5.529254 -1.178507 1.039624
C  6.179182 4.281826 0.923843
C  -8.43918 -0.410529 -0.029914
H  2.098749 1.650728 -2.889128
H  0.948525 2.37004 -1.766745
H  2.758641 -0.61861 0.926857
H  2.845101 -0.713922 -3.350698
H  4.421077 2.085237 -2.677796
H  1.824532 2.909083 0.62617
H  5.623452 -3.074668 -1.132134
H  4.717826 -2.312234 -3.279202
H  6.287217 3.160043 -1.487276
H  3.681957 3.994481 1.820804
H  0.706421 -1.806643 -0.334065
H  -1.720539 0.566399 -0.488054
H  -3.6654 1.652691 -0.77839
H  -3.654001 -2.165416 1.193717
H  -6.073198 1.848996 -0.37933
H  -6.047799 -1.966228 1.571043
elementType: F O N C H
totalener: -1892.96909280 hartree
nucrepener: 3577.34394566 hartree
electener: -5470.31303846 hartree
oneelecener: -9707.95545478 hartree
twoeener: 4237.64241632 hartree
cpcmener: -0.04632667 hartree
kineticenergy: 1885.77236529 hartree
xcener: -170.258811097906 hartree
chargesum: -0.0000000
charge: -0.178936 -0.182152 -0.182223 -0.167068 -0.174933 -0.175982 -0.309475 -0.529045 -0.246100 -0.039083 -0.165727 -0.113110 -0.077944 0.209914 -0.026516 0.032746 -0.211697 -0.057870 -0.180159 -0.153232 -0.165789 -0.109206 -0.134779 0.554184 -0.178908 -0.179712 0.181528 0.205939 0.420880 -0.223590 -0.230302 0.172038 -0.127956 -0.131482 -0.113167 0.587297 0.118012 0.113088 0.148860 0.148233 0.144798 0.145528 0.154674 0.161540 0.155291 0.156555 0.175303 0.178067 0.139958 0.156471 0.153341 0.151896
qa: -0.1789 -0.1822 -0.1822 -0.1671 -0.1749 -0.1760 -0.3095 -0.5290 -0.2461 -0.0391 -0.1657 -0.1131 -0.0779 0.2099 -0.0265 0.0327 -0.2117 -0.0579 -0.1802 -0.1532 -0.1658 -0.1092 -0.1348 0.5542 -0.1789 -0.1797 0.1815 0.2059 0.4209 -0.2236 -0.2303 0.1720 -0.1280 -0.1315 -0.1132 0.5873 0.1180 0.1131 0.1489 0.1482 0.1448 0.1455 0.1547 0.1615 0.1553 0.1566 0.1753 0.1781 0.1400 0.1565 0.1533 0.1519
va: 1.1265 1.1143 1.1148 1.1377 1.1242 1.1229 2.0829 1.9815 3.0070 3.1515 3.2064 3.1246 3.8382 3.7431 3.6431 3.6278 4.0095 3.7337 3.9614 3.9302 3.9413 3.9266 3.9213 4.4387 4.0217 3.9975 3.6147 3.8014 4.3422 3.9710 3.9755 3.7602 4.0191 4.0308 4.0061 4.6197 1.0033 1.0215 1.0239 1.0042 1.0024 1.0063 1.0037 0.9902 1.0037 1.0029 1.0287 1.0316 1.0063 1.0318 0.9994 1.0014
dispcorr: -0.025536522 hartree
energy: -1892.994629323536
dipole: 24.54336 -23.75247 0.79089 16.02666 -15.42135 0.60531 -15.70816 12.40579 -3.30237
magnitude: 3.44929 au
magnitude: 8.76739 debye
