program: Orca
programVersion: 5.0.2
elementType: F F F F F F O O N N N N C C C C C C C C C C C C C C C C C C C C C C C C H H H H H H H H H H H H H H H H
charge: 0
multiplicity: 1
keywords: wb97x-d3
keywords: def2-TZVPP
keywords: def2/J RIJCOSX
keywords: DEFGRID2
keywords: scfconv7
keywords: smallprint printgap noloewdin
keywords: NOSOSCF
formula: C24H16F6N4O2
InChI: InChI=1/C24H16F6N4O2/c25-23(26,27)18-3-1-2-17(13-18)21(12-15-4-6-16(14-31)7-5-15)33-34-22(35)32-19-8-10-20(11-9-19)36-24(28,29)30/h1-11,13,32,34H,12H2
52 atoms
F  5.412534 -3.353043 1.235495
F  6.260135 -1.388375 1.417249
F  6.850688 -2.666239 -0.208572
F  -9.912946 -0.061297 0.267722
F  -8.411387 0.095487 1.801977
F  -8.423652 -1.603272 0.497582
O  -7.903403 0.391406 -0.345592
O  -1.957071 -1.941953 -1.882551
N  0.19564 -0.081371 0.092154
N  -0.239288 -0.95555 -0.82655
N  -2.378801 -0.247459 -0.392934
N  6.975643 5.061351 -0.556972
C  1.809156 1.009214 1.448682
C  1.437065 0.05746 0.340921
C  2.550814 -0.612206 -0.373612
C  2.929471 1.929318 1.045349
C  3.584224 -1.19573 0.351407
C  4.693387 -1.718573 -0.30117
C  2.6443 -0.562229 -1.765109
C  2.754381 2.820855 -0.011723
C  4.16579 1.871141 1.680698
C  4.774157 -1.678836 -1.686448
C  3.743098 -1.101273 -2.412098
C  5.805345 -2.284781 0.528289
C  3.789865 3.63367 -0.431904
C  5.213264 2.679098 1.274222
C  5.025966 3.559945 0.21145
C  -3.767087 -0.1493 -0.424194
C  -1.580598 -1.101609 -1.082913
C  -4.599547 -0.921935 -1.236579
C  -4.346388 0.804022 0.418441
C  -6.524576 0.193259 -0.33793
C  -5.973788 -0.747109 -1.186467
C  -5.717089 0.978931 0.465087
C  6.102082 4.392276 -0.215701
C  -8.637679 -0.287418 0.542872
H  0.920161 1.578523 1.726606
H  2.106493 0.438657 2.33348
H  3.522427 -1.228576 1.432676
H  1.873647 -0.07465 -2.349475
H  1.797761 2.87756 -0.517255
H  4.31631 1.182043 2.502293
H  5.630996 -2.077122 -2.212019
H  3.808318 -1.054215 -3.490745
H  3.645738 4.321073 -1.254688
H  6.171543 2.622686 1.773068
H  0.378617 -1.620834 -1.279373
H  -1.900431 0.379447 0.241491
H  -4.196436 -1.659229 -1.910064
H  -3.716372 1.421831 1.047511
H  -6.608212 -1.34445 -1.828653
H  -6.142005 1.733585 1.113895
elementType: F O N C H
totalener: -1892.96730372 hartree
nucrepener: 3565.18836208 hartree
electener: -5458.15566580 hartree
oneelecener: -9683.24616827 hartree
twoeener: 4225.09050247 hartree
cpcmener: -0.04527366 hartree
kineticenergy: 1885.77769602 hartree
xcener: -170.262616610943 hartree
chargesum: 0.0000000
charge: -0.182378 -0.182627 -0.178863 -0.167038 -0.176983 -0.174369 -0.309922 -0.529066 -0.247994 -0.043854 -0.160817 -0.114352 -0.077863 0.214726 0.059634 0.038279 -0.266763 -0.038975 -0.233676 -0.196227 -0.159682 -0.108460 -0.134612 0.551792 -0.168683 -0.171835 0.183671 0.204345 0.420557 -0.230985 -0.224444 0.169413 -0.133892 -0.125490 -0.113053 0.587777 0.113901 0.115645 0.149266 0.162415 0.149124 0.144887 0.154202 0.162844 0.157424 0.155327 0.176408 0.177255 0.159392 0.139490 0.151841 0.153291
qa: -0.1824 -0.1826 -0.1789 -0.1670 -0.1770 -0.1744 -0.3099 -0.5291 -0.2480 -0.0439 -0.1608 -0.1144 -0.0779 0.2147 0.0596 0.0383 -0.2668 -0.0390 -0.2337 -0.1962 -0.1597 -0.1085 -0.1346 0.5518 -0.1687 -0.1718 0.1837 0.2043 0.4206 -0.2310 -0.2244 0.1694 -0.1339 -0.1255 -0.1131 0.5878 0.1139 0.1156 0.1493 0.1624 0.1491 0.1449 0.1542 0.1628 0.1574 0.1553 0.1764 0.1773 0.1594 0.1395 0.1518 0.1533
va: 1.1137 1.1109 1.1258 1.1378 1.1222 1.1244 2.0825 1.9824 2.9884 3.1544 3.2097 3.1259 3.8215 3.7288 3.5507 3.6138 4.0512 3.7142 3.9533 3.9351 3.9273 3.9319 3.9285 4.4347 3.9864 4.0109 3.6177 3.8171 4.3448 3.9626 3.9686 3.7591 4.0317 4.0240 4.0066 4.6191 1.0182 1.0034 1.0180 1.0040 1.0039 1.0037 1.0039 0.9899 1.0024 1.0040 1.0285 1.0323 1.0337 1.0063 1.0009 1.0003
dispcorr: -0.026049380 hartree
energy: -1892.993353101032
dipole: 18.38686 -17.92287 0.46399 15.27184 -15.24540 0.02644 -7.10415 7.92546 0.82132
magnitude: 0.94369 au
magnitude: 2.39867 debye
