program: Orca
programVersion: 5.0.2
elementType: F F F F F F O O N N N N C C C C C C C C C C C C C C C C C C C C C C C C H H H H H H H H H H H H H H H H
charge: 0
multiplicity: 1
keywords: wb97x-d3
keywords: def2-TZVPP
keywords: def2/J RIJCOSX
keywords: DEFGRID2
keywords: scfconv7
keywords: smallprint printgap noloewdin
keywords: NOSOSCF
formula: C24H16F6N4O2
InChI: InChI=1/C24H16F6N4O2/c25-23(26,27)18-3-1-2-17(13-18)21(12-15-4-6-16(14-31)7-5-15)33-34-22(35)32-19-8-10-20(11-9-19)36-24(28,29)30/h1-11,13,32,34H,12H2
52 atoms
F  6.990518 -4.426985 -0.974319
F  6.688266 -2.532994 -1.951682
F  5.346256 -4.164464 -2.331196
F  -8.342812 1.931747 -0.545726
F  -7.317397 0.126027 -1.116953
F  -6.541457 2.029159 -1.724855
O  -6.483824 1.489933 0.435171
O  -1.330656 -2.581024 0.945973
N  1.352529 -0.448954 0.505119
N  0.672689 -1.578852 0.737036
N  -1.228878 -0.307874 0.63748
N  -1.575569 5.765725 0.008047
C  3.266207 0.910312 0.123187
C  2.618782 -0.420253 0.412968
C  3.507733 -1.592147 0.599388
C  2.267802 2.027549 0.072854
C  4.34597 -2.013899 -0.425707
C  5.184031 -3.106848 -0.235027
C  3.525476 -2.266104 1.820274
C  1.57415 2.307046 -1.102033
C  1.966959 2.752818 1.222056
C  5.19181 -3.780522 0.978892
C  4.362589 -3.352748 2.00459
C  6.054825 -3.558934 -1.367787
C  0.59169 3.279256 -1.132314
C  0.988479 3.730788 1.20986
C  0.293263 3.990189 0.030171
C  -2.567684 0.06582 0.60445
C  -0.700401 -1.550531 0.781134
C  -3.641334 -0.796492 0.832448
C  -2.83111 1.411755 0.331111
C  -5.177354 1.009881 0.468321
C  -4.941007 -0.318748 0.762553
C  -4.126814 1.88602 0.260506
C  -0.739271 4.973238 0.01681
C  -7.147484 1.389806 -0.721675
H  4.020714 1.102328 0.891118
H  3.8130 0.837224 -0.822382
H  4.332202 -1.48712 -1.3723
H  2.891791 -1.93275 2.632903
H  1.79777 1.751379 -2.004168
H  2.497801 2.546209 2.142987
H  5.837638 -4.631751 1.143757
H  4.374763 -3.869627 2.954373
H  0.053276 3.484456 -2.048046
H  0.758132 4.285326 2.10969
H  1.115751 -2.49118 0.772595
H  -0.55581 0.433179 0.483382
H  -3.48597 -1.836734 1.065202
H  -2.009563 2.09934 0.166178
H  -5.763082 -0.995327 0.956032
H  -4.308424 2.933096 0.054686
elementType: F O N C H
totalener: -1892.96810651 hartree
nucrepener: 3645.69415176 hartree
electener: -5538.66225826 hartree
oneelecener: -9844.63300473 hartree
twoeener: 4305.97074647 hartree
cpcmener: -0.04526450 hartree
kineticenergy: 1885.79343045 hartree
xcener: -170.265663086325 hartree
chargesum: -0.0000000
charge: -0.179922 -0.183258 -0.181384 -0.167349 -0.175754 -0.175544 -0.309325 -0.528329 -0.229069 -0.084814 -0.165249 -0.110829 -0.086903 0.238401 -0.026325 0.048655 -0.162165 -0.084967 -0.192142 -0.158095 -0.155227 -0.105369 -0.154312 0.550343 -0.183075 -0.163611 0.162155 0.151732 0.418844 -0.204267 -0.142516 0.198421 -0.147632 -0.178935 -0.112302 0.588083 0.115362 0.117772 0.144867 0.162649 0.143889 0.143422 0.153238 0.161839 0.153534 0.154627 0.173219 0.186245 0.154196 0.128742 0.151753 0.146682
qa: -0.1799 -0.1833 -0.1814 -0.1673 -0.1758 -0.1755 -0.3093 -0.5283 -0.2291 -0.0848 -0.1652 -0.1108 -0.0869 0.2384 -0.0263 0.0487 -0.1622 -0.0850 -0.1921 -0.1581 -0.1552 -0.1054 -0.1543 0.5503 -0.1831 -0.1636 0.1622 0.1517 0.4188 -0.2043 -0.1425 0.1984 -0.1476 -0.1789 -0.1123 0.5881 0.1154 0.1178 0.1449 0.1626 0.1439 0.1434 0.1532 0.1618 0.1535 0.1546 0.1732 0.1862 0.1542 0.1287 0.1518 0.1467
va: 1.1238 1.1157 1.1106 1.1374 1.1234 1.1234 2.0835 1.9865 2.9780 3.1780 3.2101 3.1217 3.8609 3.7616 3.6357 3.6428 4.0511 3.7570 3.9516 3.9164 3.9532 3.9278 3.9387 4.4371 3.9636 3.9862 3.5972 3.8898 4.3476 3.9480 3.8849 3.7344 4.0454 4.0787 3.9953 4.6179 1.0053 1.0036 1.0215 0.9998 1.0010 1.0016 1.0046 0.9908 1.0055 1.0036 1.0294 1.0218 1.0349 1.0091 1.0026 1.0071
dispcorr: -0.027380334 hartree
energy: -1892.995486842326
dipole: 17.51028 -12.94275 4.56753 8.93371 -9.77338 -0.83967 16.89968 -15.82967 1.07000
magnitude: 4.76574 au
magnitude: 12.11356 debye
