program: Orca
programVersion: 5.0.2
elementType: F F F F F F O O N N N N C C C C C C C C C C C C C C C C C C C C C C C C H H H H H H H H H H H H H H H H
charge: 0
multiplicity: 1
keywords: wb97x-d3
keywords: def2-TZVPP
keywords: def2/J RIJCOSX
keywords: DEFGRID2
keywords: scfconv7
keywords: smallprint printgap noloewdin
keywords: NOSOSCF
formula: C24H16F6N4O2
InChI: InChI=1/C24H16F6N4O2/c25-23(26,27)18-3-1-2-17(13-18)21(12-15-4-6-16(14-31)7-5-15)33-34-22(35)32-19-8-10-20(11-9-19)36-24(28,29)30/h1-11,13,32,34H,12H2
52 atoms
F  7.439308 -3.888017 0.723963
F  5.91679 -3.835717 2.240691
F  6.896466 -2.02164 1.640499
F  -6.339617 2.523236 1.676371
F  -7.258175 0.591681 1.564077
F  -8.234421 2.292565 0.676784
O  -6.488078 1.522872 -0.309421
O  -1.437491 -2.754271 -0.609166
N  1.26703 -0.604844 -0.517078
N  0.581402 -1.75143 -0.613772
N  -1.302504 -0.462003 -0.525238
N  -1.652071 5.689412 -0.254028
C  3.167961 0.811702 -0.349386
C  2.535857 -0.549984 -0.506145
C  3.453508 -1.703971 -0.651873
C  2.15986 1.920607 -0.317484
C  4.460688 -1.910075 0.284951
C  5.353226 -2.962475 0.132899
C  3.356787 -2.561727 -1.747583
C  1.782792 2.562055 -1.493761
C  1.55001 2.291108 0.878706
C  5.247698 -3.820095 -0.954418
C  4.248205 -3.611868 -1.892654
C  6.404175 -3.177522 1.179023
C  0.813097 3.548459 -1.486241
C  0.577784 3.273916 0.905147
C  0.204958 3.902055 -0.283055
C  -2.628703 -0.050348 -0.470691
C  -0.794149 -1.719057 -0.578638
C  -2.838168 1.327356 -0.35596
C  -3.735982 -0.896941 -0.532597
C  -5.198496 0.996308 -0.331426
C  -4.112468 1.853465 -0.287702
C  -5.016805 -0.366986 -0.459474
C  -0.817586 4.895359 -0.270739
C  -7.057616 1.723238 0.884769
H  3.763898 0.818827 0.568492
H  3.877739 0.96098 -1.167635
H  4.538975 -1.24607 1.136286
H  2.597462 -2.399515 -2.502672
H  2.250812 2.285688 -2.430177
H  1.834006 1.801379 1.80184
H  5.935604 -4.643681 -1.088733
H  4.169607 -4.268796 -2.748109
H  0.525401 4.039681 -2.406056
H  0.10513 3.55111 1.838013
H  1.022817 -2.664796 -0.576229
H  -0.609839 0.276079 -0.483537
H  -1.988565 1.999019 -0.319643
H  -3.621777 -1.963357 -0.636509
H  -4.248811 2.924333 -0.21519
H  -5.869394 -1.031062 -0.519244
elementType: F O N C H
totalener: -1892.96779672 hartree
nucrepener: 3647.36649841 hartree
electener: -5540.33429514 hartree
oneelecener: -9847.93171137 hartree
twoeener: 4307.59741624 hartree
cpcmener: -0.04523975 hartree
kineticenergy: 1885.78723663 hartree
xcener: -170.265435847079 hartree
chargesum: -0.0000000
charge: -0.179921 -0.180762 -0.182713 -0.175456 -0.175807 -0.166865 -0.309808 -0.527702 -0.230538 -0.091150 -0.164517 -0.109467 -0.092522 0.241563 -0.007093 0.042918 -0.165131 -0.081354 -0.193968 -0.152247 -0.158972 -0.108139 -0.159567 0.547791 -0.163135 -0.178317 0.162748 0.141632 0.419284 -0.129256 -0.191786 0.205557 -0.186120 -0.159418 -0.113670 0.587237 0.116556 0.116391 0.143568 0.163522 0.143130 0.144050 0.152378 0.162170 0.154121 0.153367 0.174208 0.187548 0.124373 0.152775 0.146831 0.151686
qa: -0.1799 -0.1808 -0.1827 -0.1755 -0.1758 -0.1669 -0.3098 -0.5277 -0.2305 -0.0912 -0.1645 -0.1095 -0.0925 0.2416 -0.0071 0.0429 -0.1651 -0.0814 -0.1940 -0.1522 -0.1590 -0.1081 -0.1596 0.5478 -0.1631 -0.1783 0.1627 0.1416 0.4193 -0.1293 -0.1918 0.2056 -0.1861 -0.1594 -0.1137 0.5872 0.1166 0.1164 0.1436 0.1635 0.1431 0.1441 0.1524 0.1622 0.1541 0.1534 0.1742 0.1875 0.1244 0.1528 0.1468 0.1517
va: 1.1231 1.1089 1.1174 1.1232 1.1235 1.1378 2.0835 1.9883 2.9762 3.1775 3.2074 3.1220 3.8611 3.7644 3.6332 3.6414 4.0480 3.7569 3.9500 3.9468 3.9197 3.9431 3.9462 4.4367 3.9782 3.9607 3.6010 3.8971 4.3499 3.8663 3.9399 3.7324 4.0760 4.0637 4.0002 4.6189 1.0034 1.0039 1.0224 1.0006 1.0018 1.0008 1.0046 0.9908 1.0036 1.0051 1.0285 1.0220 1.0151 1.0345 1.0098 1.0018
dispcorr: -0.027464140 hartree
energy: -1892.995260860707
dipole: 14.74716 -10.31779 4.42937 4.28108 -5.39551 -1.11443 -17.18089 15.95649 -1.22441
magnitude: 4.72868 au
magnitude: 12.01935 debye
