program: Orca
programVersion: 5.0.2
elementType: F F F F F F O O N N N N C C C C C C C C C C C C C C C C C C C C C C C C H H H H H H H H H H H H H H H H
charge: 0
multiplicity: 1
keywords: wb97x-d3
keywords: def2-TZVPP
keywords: def2/J RIJCOSX
keywords: DEFGRID2
keywords: scfconv7
keywords: smallprint printgap noloewdin
keywords: NOSOSCF
formula: C24H16F6N4O2
InChI: InChI=1/C24H16F6N4O2/c25-23(26,27)18-3-1-2-17(13-18)21(12-15-4-6-16(14-31)7-5-15)33-34-22(35)32-19-8-10-20(11-9-19)36-24(28,29)30/h1-11,13,32,34H,12H2
52 atoms
F  4.946527 -4.06992 0.686502
F  5.962332 -2.377982 1.5331
F  6.633684 -3.21222 -0.333043
F  -9.800159 -0.012381 0.294429
F  -8.25271 -0.191726 1.781805
F  -8.385049 -1.634785 0.204248
O  -7.785971 0.450371 -0.297735
O  -1.826221 -1.803568 -1.919091
N  0.311361 -0.052062 0.17162
N  -0.115057 -0.864195 -0.808101
N  -2.260148 -0.189372 -0.34677
N  6.470773 5.64089 -0.560519
C  1.94064 0.948864 1.585331
C  1.551354 0.060678 0.435789
C  2.652959 -0.589605 -0.317127
C  2.932052 1.995942 1.153056
C  3.547502 -1.428558 0.337353
C  4.614845 -1.988881 -0.355434
C  2.843666 -0.307198 -1.669337
C  2.520925 3.050693 0.340081
C  4.272144 1.905123 1.516244
C  4.798077 -1.709849 -1.703041
C  3.910015 -0.86572 -2.35351
C  5.543162 -2.909926 0.376975
C  3.425423 3.997599 -0.102477
C  5.191301 2.843762 1.080892
C  4.767104 3.89173 0.266696
C  -3.64861 -0.092386 -0.382939
C  -1.454554 -1.003909 -1.07626
C  -4.471158 -0.77295 -1.283066
C  -4.239255 0.768148 0.547585
C  -6.407843 0.245621 -0.298437
C  -5.846379 -0.601292 -1.233766
C  -5.609968 0.940459 0.593154
C  5.707857 4.859197 -0.194627
C  -8.531128 -0.338776 0.484534
H  1.039522 1.413321 1.988891
H  2.376045 0.339591 2.382374
H  3.401902 -1.640734 1.390037
H  2.168108 0.364842 -2.184801
H  1.4809 3.132187 0.047542
H  4.604762 1.089196 2.145897
H  5.625631 -2.132228 -2.256332
H  4.057435 -0.638026 -3.400667
H  3.098469 4.815068 -0.731405
H  6.231215 2.76404 1.368585
H  0.51045 -1.490763 -1.30457
H  -1.790068 0.39944 0.329265
H  -4.060175 -1.434574 -2.027042
H  -3.617925 1.312946 1.248682
H  -6.471187 -1.12454 -1.946284
H  -6.043399 1.622687 1.312933
elementType: F O N C H
totalener: -1892.96888650 hartree
nucrepener: 3549.96596537 hartree
electener: -5442.93485188 hartree
oneelecener: -9652.73610179 hartree
twoeener: 4209.80124992 hartree
cpcmener: -0.04517600 hartree
kineticenergy: 1885.76001244 hartree
xcener: -170.257206945855 hartree
chargesum: -0.0000000
charge: -0.181463 -0.182847 -0.179607 -0.167009 -0.176475 -0.174883 -0.310074 -0.528947 -0.246456 -0.042883 -0.161628 -0.113949 -0.082464 0.212941 0.009039 0.031868 -0.225583 -0.038056 -0.205402 -0.174567 -0.152191 -0.113814 -0.142230 0.551746 -0.176758 -0.177937 0.182744 0.204883 0.419679 -0.232311 -0.224209 0.171342 -0.133922 -0.126411 -0.113151 0.588385 0.112971 0.119400 0.140513 0.161432 0.146223 0.145623 0.154070 0.162361 0.157051 0.155776 0.175610 0.177702 0.158749 0.139814 0.152344 0.152963
qa: -0.1815 -0.1828 -0.1796 -0.1670 -0.1765 -0.1749 -0.3101 -0.5289 -0.2465 -0.0429 -0.1616 -0.1139 -0.0825 0.2129 0.0090 0.0319 -0.2256 -0.0381 -0.2054 -0.1746 -0.1522 -0.1138 -0.1422 0.5517 -0.1768 -0.1779 0.1827 0.2049 0.4197 -0.2323 -0.2242 0.1713 -0.1339 -0.1264 -0.1132 0.5884 0.1130 0.1194 0.1405 0.1614 0.1462 0.1456 0.1541 0.1624 0.1571 0.1558 0.1756 0.1777 0.1587 0.1398 0.1523 0.1530
va: 1.1117 1.1149 1.1247 1.1381 1.1225 1.1244 2.0826 1.9825 2.9999 3.1541 3.2089 3.1251 3.8314 3.7330 3.6045 3.6346 4.0473 3.7133 3.9486 3.9426 3.9222 3.9397 3.9347 4.4347 3.9955 4.0171 3.6147 3.8148 4.3441 3.9678 3.9667 3.7593 4.0329 4.0212 4.0066 4.6185 1.0215 1.0034 1.0259 1.0019 1.0060 1.0025 1.0044 0.9901 1.0026 1.0036 1.0281 1.0316 1.0332 1.0062 1.0011 0.9999
dispcorr: -0.025631028 hartree
energy: -1892.994517531105
dipole: 20.10604 -19.27493 0.83112 19.14813 -19.10950 0.03863 -5.31351 6.35027 1.03676
magnitude: 1.32933 au
magnitude: 3.37889 debye
