program: Orca
programVersion: 5.0.2
elementType: F F F F F F O O N N N N C C C C C C C C C C C C C C C C C C C C C C C C H H H H H H H H H H H H H H H H
charge: 0
multiplicity: 1
keywords: wb97x-d3
keywords: def2-TZVPP
keywords: def2/J RIJCOSX
keywords: DEFGRID2
keywords: scfconv7
keywords: smallprint printgap noloewdin
keywords: NOSOSCF
formula: C24H16F6N4O2
InChI: InChI=1/C24H16F6N4O2/c25-23(26,27)18-3-1-2-17(13-18)21(12-15-4-6-16(14-31)7-5-15)33-34-22(35)32-19-8-10-20(11-9-19)36-24(28,29)30/h1-11,13,32,34H,12H2
52 atoms
F  7.460242 -4.038055 0.23803
F  6.25983 -3.657318 1.9804
F  7.215774 -2.028872 0.959635
F  -6.843593 2.291049 -1.082888
F  -8.401296 2.10426 0.392982
F  -7.54968 0.349739 -0.521627
O  -6.408962 1.547568 0.969837
O  -1.355875 -2.668709 0.510516
N  1.286667 -0.571629 -0.237697
N  0.606192 -1.705286 -0.026878
N  -1.257378 -0.395274 0.201414
N  -1.613352 5.662995 0.017469
C  3.175143 0.801699 -0.671002
C  2.531294 -0.550872 -0.491423
C  3.38877 -1.748681 -0.661938
C  2.192886 1.925325 -0.523937
C  4.548683 -1.903217 0.090462
C  5.356724 -3.019373 -0.092739
C  3.055114 -2.719082 -1.607081
C  1.524999 2.42802 -1.636555
C  1.88508 2.4354 0.735253
C  5.014277 -3.987057 -1.028011
C  3.863756 -3.828543 -1.785367
C  6.574925 -3.186814 0.76471
C  0.558999 3.40924 -1.502343
C  0.920819 3.4144 0.888888
C  0.249867 3.898346 -0.234126
C  -2.574359 0.01012 0.391864
C  -0.738143 -1.64872 0.255313
C  -2.835695 1.372272 0.213488
C  -3.625488 -0.833981 0.753858
C  -5.137438 1.030697 0.734821
C  -4.107766 1.885179 0.381407
C  -4.901374 -0.31723 0.923175
C  -0.773813 4.880462 -0.088914
C  -7.275299 1.567257 -0.049282
H  3.985998 0.907787 0.056192
H  3.650402 0.831583 -1.655552
H  4.80952 -1.150454 0.823983
H  2.169621 -2.60134 -2.219605
H  1.755044 2.042346 -2.622006
H  2.398683 2.054956 1.609498
H  5.632347 -4.860973 -1.182373
H  3.599893 -4.574073 -2.523161
H  0.041354 3.78961 -2.372831
H  0.682844 3.798237 1.871921
H  1.056308 -2.610745 0.057379
H  -0.595893 0.337758 -0.023957
H  -2.0293 2.04304 -0.059542
H  -3.470078 -1.88821 0.911269
H  -4.282426 2.945507 0.252021
H  -5.704034 -0.979142 1.221526
elementType: F O N C H
totalener: -1892.96802087 hartree
nucrepener: 3642.81314627 hartree
electener: -5535.78116715 hartree
oneelecener: -9838.86731332 hartree
twoeener: 4303.08614617 hartree
cpcmener: -0.04520281 hartree
kineticenergy: 1885.77521440 hartree
xcener: -170.262949249356 hartree
chargesum: -0.0000000
charge: -0.180372 -0.181036 -0.182363 -0.175213 -0.166959 -0.175708 -0.310093 -0.528667 -0.230031 -0.089238 -0.163360 -0.112087 -0.093597 0.240527 -0.008337 0.053557 -0.166697 -0.078160 -0.198048 -0.154802 -0.163569 -0.109910 -0.156954 0.547534 -0.161271 -0.162174 0.139578 0.158848 0.418870 -0.156705 -0.207571 0.193608 -0.171390 -0.145318 -0.107909 0.587504 0.117663 0.115502 0.144531 0.163308 0.143162 0.143265 0.152945 0.161860 0.152809 0.154369 0.174551 0.185306 0.135555 0.154523 0.146596 0.151569
qa: -0.1804 -0.1810 -0.1824 -0.1752 -0.1670 -0.1757 -0.3101 -0.5287 -0.2300 -0.0892 -0.1634 -0.1121 -0.0936 0.2405 -0.0083 0.0536 -0.1667 -0.0782 -0.1980 -0.1548 -0.1636 -0.1099 -0.1570 0.5475 -0.1613 -0.1622 0.1396 0.1588 0.4189 -0.1567 -0.2076 0.1936 -0.1714 -0.1453 -0.1079 0.5875 0.1177 0.1155 0.1445 0.1633 0.1432 0.1433 0.1529 0.1619 0.1528 0.1544 0.1746 0.1853 0.1356 0.1545 0.1466 0.1516
va: 1.1229 1.1087 1.1177 1.1239 1.1380 1.1234 2.0829 1.9865 2.9703 3.1790 3.2089 3.1189 3.8641 3.7629 3.6298 3.6303 4.0497 3.7529 3.9545 3.9372 3.9326 3.9432 3.9448 4.4372 3.9608 3.9707 3.6121 3.8870 4.3483 3.8963 3.9521 3.7402 4.0739 4.0463 3.9938 4.6200 1.0034 1.0049 1.0221 1.0004 1.0016 1.0007 1.0047 0.9908 1.0048 1.0036 1.0284 1.0222 1.0055 1.0349 1.0082 1.0024
dispcorr: -0.027422534 hartree
energy: -1892.995443407444
dipole: 14.54575 -10.30731 4.23844 4.81990 -5.98798 -1.16808 -7.36088 5.85797 -1.50291
magnitude: 4.64624 au
magnitude: 11.80980 debye
