program: Orca
programVersion: 5.0.2
elementType: F F F F F F O O N N N N C C C C C C C C C C C C C C C C C C C C C C C C H H H H H H H H H H H H H H H H
charge: 0
multiplicity: 1
keywords: wb97x-d3
keywords: def2-TZVPP
keywords: def2/J RIJCOSX
keywords: DEFGRID2
keywords: scfconv7
keywords: smallprint printgap noloewdin
keywords: NOSOSCF
formula: C24H16F6N4O2
InChI: InChI=1/C24H16F6N4O2/c25-23(26,27)18-3-1-2-17(13-18)21(12-15-4-6-16(14-31)7-5-15)33-34-22(35)32-19-8-10-20(11-9-19)36-24(28,29)30/h1-11,13,32,34H,12H2
52 atoms
F  4.471751 -1.194045 -2.423869
F  6.013224 -2.464188 -1.61695
F  6.02744 -0.34877 -1.208435
F  -7.647568 1.146013 -1.779467
F  -9.527538 0.384515 -1.045232
F  -8.099114 -0.942607 -1.955748
O  -7.748893 -0.089317 0.067254
O  -1.707203 -2.70583 0.065748
N  0.274144 -0.147633 1.306929
N  -0.089956 -1.331276 0.80462
N  -2.259877 -0.586247 0.761893
N  6.440671 4.17013 -2.217074
C  1.867982 1.440345 2.117638
C  1.499015 0.095763 1.547825
C  2.600499 -0.866973 1.288029
C  2.864365 2.137763 1.230248
C  3.344729 -0.761891 0.119515
C  4.404726 -1.625622 -0.116452
C  2.911911 -1.86373 2.209267
C  2.440681 2.771347 0.0652
C  4.2265 2.069067 1.500217
C  4.716421 -2.612967 0.806704
C  3.962434 -2.733322 1.96446
C  5.233201 -1.415982 -1.349335
C  3.355525 3.309227 -0.821132
C  5.153294 2.597628 0.620023
C  4.719796 3.215399 -0.549736
C  -3.635101 -0.533502 0.549417
C  -1.411972 -1.619802 0.506814
C  -4.409852 -1.618371 0.13906
C  -4.260724 0.692428 0.781787
C  -6.375835 -0.240239 0.191995
C  -5.775868 -1.464646 -0.034702
C  -5.621366 0.843812 0.601549
C  5.671834 3.745524 -1.472686
C  -8.237693 0.121484 -1.162602
H  0.958927 2.03255 2.231545
H  2.296162 1.304558 3.115323
H  3.095258 0.005466 -0.602152
H  2.332407 -1.956211 3.119597
H  1.382658 2.829594 -0.15983
H  4.570076 1.57386 2.399648
H  5.539219 -3.292142 0.632938
H  4.199732 -3.508024 2.680663
H  3.019567 3.795552 -1.726669
H  6.211109 2.525312 0.831162
H  0.58394 -2.058165 0.595374
H  -1.824788 0.250354 1.120357
H  -3.95784 -2.578568 -0.04585
H  -3.67563 1.546358 1.103147
H  -6.368985 -2.316575 -0.338217
H  -6.093922 1.798559 0.788854
totalener: -1892.93519586 hartree
nucrepener: 3621.69503144 hartree
electener: -5514.63022730 hartree
oneelecener: -9797.02986715 hartree
twoeener: 4282.39963985 hartree
kineticenergy: 1885.87520753 hartree
xcener: -170.272243155282 hartree
chargesum: 0.0000000
charge: -0.168842 -0.169305 -0.162899 -0.169417 -0.157267 -0.171454 -0.296363 -0.419012 -0.209113 -0.049194 -0.178850 -0.006315 -0.100286 0.173001 -0.128107 0.024073 -0.165154 -0.056514 -0.141183 -0.152842 -0.094590 -0.104224 -0.109768 0.543576 -0.166499 -0.191158 0.194372 0.203444 0.392112 -0.196704 -0.197628 0.143147 -0.085189 -0.105459 -0.175478 0.575490 0.106491 0.100007 0.140033 0.133481 0.124160 0.116568 0.141585 0.138489 0.138601 0.133010 0.156302 0.145797 0.155549 0.097636 0.127563 0.124327
qa: -0.1688 -0.1693 -0.1629 -0.1694 -0.1573 -0.1715 -0.2964 -0.4190 -0.2091 -0.0492 -0.1789 -0.0063 -0.1003 0.1730 -0.1281 0.0241 -0.1652 -0.0565 -0.1412 -0.1528 -0.0946 -0.1042 -0.1098 0.5436 -0.1665 -0.1912 0.1944 0.2034 0.3921 -0.1967 -0.1976 0.1431 -0.0852 -0.1055 -0.1755 0.5755 0.1065 0.1000 0.1400 0.1335 0.1242 0.1166 0.1416 0.1385 0.1386 0.1330 0.1563 0.1458 0.1555 0.0976 0.1276 0.1243
va: 1.1388 1.1389 1.1299 1.1316 1.1522 1.1307 2.1015 2.0974 3.0297 3.1502 3.2118 3.1278 3.8908 3.7563 3.7446 3.5967 3.9913 3.8356 3.9821 3.9725 3.9233 3.9750 3.9508 4.4352 4.0353 4.0339 3.6821 3.8786 4.3417 4.0113 4.0064 3.8743 4.0248 4.0808 3.9885 4.6319 1.0234 1.0099 1.0212 1.0093 1.0140 1.0087 1.0106 0.9996 1.0107 1.0120 1.0444 1.0564 1.0340 1.0160 1.0115 1.0083
dispcorr: -0.026995405 hartree
energy: -1892.962191265330
dipole: 19.75744 -18.96570 0.79174 5.15697 -5.32647 -0.16950 24.71708 -22.00425 2.71283
magnitude: 2.83108 au
magnitude: 7.19603 debye
