program: Orca
programVersion: 5.0.2
elementType: F F F F F F O O N N N N C C C C C C C C C C C C C C C C C C C C C C C C H H H H H H H H H H H H H H H H
charge: 0
multiplicity: 1
keywords: wb97x-d3
keywords: def2-TZVPP
keywords: def2/J RIJCOSX
keywords: DEFGRID2
keywords: scfconv7
keywords: smallprint printgap noloewdin
keywords: NOSOSCF
formula: C24H16F6N4O2
InChI: InChI=1/C24H16F6N4O2/c25-23(26,27)18-3-1-2-17(13-18)21(12-15-4-6-16(14-31)7-5-15)33-34-22(35)32-19-8-10-20(11-9-19)36-24(28,29)30/h1-11,13,32,34H,12H2
52 atoms
F  5.863807 -2.849402 -1.554463
F  6.23771 -0.774135 -1.127105
F  4.531633 -1.337816 -2.312447
F  -7.722847 1.55861 -1.489181
F  -9.452524 0.292463 -1.276335
F  -7.744442 -0.382472 -2.400651
O  -7.68139 -0.240763 -0.180472
O  -1.625669 -2.787073 0.037422
N  0.321345 -0.211975 1.298947
N  -0.034766 -1.405014 0.81437
N  -2.206425 -0.661957 0.692359
N  6.054928 4.465268 -2.437031
C  1.9009 1.395057 2.095624
C  1.541678 0.036109 1.55836
C  2.650761 -0.931259 1.351784
C  2.813754 2.123086 1.143979
C  3.389222 -0.90323 0.173451
C  4.447189 -1.782795 -0.008653
C  2.973267 -1.85719 2.339816
C  2.284895 2.778083 0.035447
C  4.194151 2.090157 1.310238
C  4.770467 -2.698612 0.983141
C  4.028732 -2.735779 2.153477
C  5.271694 -1.690536 -1.259201
C  3.112958 3.390414 -0.887084
C  5.035335 2.691228 0.390884
C  4.49551 3.345949 -0.712923
C  -3.576626 -0.620381 0.440227
C  -1.347011 -1.695776 0.476355
C  -4.251448 0.545342 0.806811
C  -4.298988 -1.656678 -0.151886
C  -6.308482 -0.34627 -0.010407
C  -5.608044 0.687192 0.584808
C  -5.658862 -1.51069 -0.373534
C  5.357771 3.969258 -1.666566
C  -8.13172 0.298607 -1.321625
H  0.982109 1.959692 2.259285
H  2.393236 1.282995 3.065981
H  3.131689 -0.187729 -0.596796
H  2.397542 -1.888779 3.256761
H  1.211904 2.804318 -0.110618
H  4.6193 1.576234 2.163087
H  5.592767 -3.388128 0.850261
H  4.27551 -3.454608 2.922793
H  2.694915 3.900888 -1.743812
H  6.1077 2.653606 0.524095
H  0.642771 -2.136604 0.634888
H  -1.791297 0.171448 1.08075
H  -3.710665 1.358336 1.277158
H  -3.81096 -2.572563 -0.440381
H  -6.115986 1.59211 0.889063
H  -6.213597 -2.323165 -0.823305
totalener: -1892.93655692 hartree
nucrepener: 3606.65017958 hartree
electener: -5499.58673650 hartree
oneelecener: -9766.88263344 hartree
twoeener: 4267.29589694 hartree
kineticenergy: 1885.84276176 hartree
xcener: -170.265851571414 hartree
chargesum: 0.0000000
charge: -0.169584 -0.165112 -0.168582 -0.172754 -0.156986 -0.169001 -0.296219 -0.419245 -0.209730 -0.049357 -0.178277 -0.007376 -0.100091 0.174980 -0.121983 0.013155 -0.171689 -0.045399 -0.128971 -0.132665 -0.110186 -0.107322 -0.118334 0.542371 -0.169125 -0.181258 0.191507 0.202244 0.393293 -0.200955 -0.191652 0.147882 -0.102541 -0.092603 -0.178090 0.574476 0.105640 0.102957 0.137056 0.131893 0.123327 0.119219 0.137716 0.138386 0.138214 0.135075 0.155215 0.145189 0.097281 0.156656 0.124557 0.126795
qa: -0.1696 -0.1651 -0.1686 -0.1728 -0.1570 -0.1690 -0.2962 -0.4192 -0.2097 -0.0494 -0.1783 -0.0074 -0.1001 0.1750 -0.1220 0.0132 -0.1717 -0.0454 -0.1290 -0.1327 -0.1102 -0.1073 -0.1183 0.5424 -0.1691 -0.1813 0.1915 0.2022 0.3933 -0.2010 -0.1917 0.1479 -0.1025 -0.0926 -0.1781 0.5745 0.1056 0.1030 0.1371 0.1319 0.1233 0.1192 0.1377 0.1384 0.1382 0.1351 0.1552 0.1452 0.0973 0.1567 0.1246 0.1268
va: 1.1373 1.1290 1.1393 1.1282 1.1523 1.1334 2.1012 2.0969 3.0294 3.1517 3.2145 3.1281 3.8875 3.7590 3.7439 3.6005 3.9832 3.8145 3.9825 3.9718 3.9339 3.9955 3.9577 4.4359 4.0501 4.0385 3.6944 3.8822 4.3397 4.0089 4.0014 3.8717 4.0836 4.0287 3.9891 4.6343 1.0242 1.0100 1.0239 1.0097 1.0145 1.0083 1.0119 0.9997 1.0107 1.0117 1.0451 1.0563 1.0161 1.0332 1.0098 1.0093
dispcorr: -0.026395322 hartree
energy: -1892.962952242410
dipole: 19.32773 -18.48691 0.84082 4.91298 -5.17600 -0.26302 24.83263 -22.01274 2.81988
magnitude: 2.95430 au
magnitude: 7.50924 debye
