program: Orca
programVersion: 5.0.2
elementType: F F F F F F O O N N N N C C C C C C C C C C C C C C C C C C C C C C C C H H H H H H H H H H H H H H H H
charge: 0
multiplicity: 1
keywords: wb97x-d3
keywords: def2-TZVPP
keywords: def2/J RIJCOSX
keywords: DEFGRID2
keywords: scfconv7
keywords: smallprint printgap noloewdin
keywords: NOSOSCF
formula: C24H16F6N4O2
InChI: InChI=1/C24H16F6N4O2/c25-23(26,27)18-3-1-2-17(13-18)21(12-15-4-6-16(14-31)7-5-15)33-34-22(35)32-19-8-10-20(11-9-19)36-24(28,29)30/h1-11,13,32,34H,12H2
52 atoms
F  -0.483858 -5.917374 0.89983
F  -0.904904 -4.390681 2.352499
F  0.516963 -4.019548 0.787022
F  8.088645 1.674388 0.625869
F  6.524844 0.557553 1.594317
F  6.286623 2.660674 1.275002
O  6.287837 1.303253 -0.491285
O  -0.015654 2.820802 -1.734271
N  -1.623084 -0.195999 -1.215789
N  -1.439936 1.093747 -1.510406
N  0.786801 0.76495 -1.0960
N  -5.242187 5.300485 2.713083
C  -4.053413 0.02135 -1.521186
C  -2.784113 -0.726976 -1.207323
C  -2.810355 -2.164942 -0.865714
C  -4.313999 1.171864 -0.578598
C  -1.786209 -2.710471 -0.091619
C  -1.7576 -4.067664 0.185796
C  -3.809895 -3.012603 -1.340141
C  -4.199949 1.006293 0.800987
C  -4.687326 2.415126 -1.082062
C  -2.754537 -4.908397 -0.295971
C  -3.777259 -4.369944 -1.058997
C  -0.659257 -4.601978 1.050697
C  -4.444346 2.060556 1.66095
C  -4.93668 3.479661 -0.234433
C  -4.810944 3.30211 1.141249
C  2.153694 0.982932 -0.95286
C  -0.179849 1.640058 -1.462309
C  2.921835 -0.133069 -0.608494
C  2.790263 2.211631 -1.129383
C  4.900608 1.195198 -0.61092
C  4.289035 -0.033856 -0.437599
C  4.162467 2.310612 -0.954229
C  -5.049708 4.401707 2.015276
C  6.776656 1.54526 0.734627
H  -4.017512 0.393204 -2.549471
H  -4.907206 -0.654573 -1.476915
H  -1.014606 -2.057142 0.294065
H  -4.613449 -2.629174 -1.954648
H  -3.914232 0.046635 1.213567
H  -4.774634 2.556438 -2.152071
H  -2.748017 -5.969394 -0.087728
H  -4.553837 -5.015375 -1.445779
H  -4.349075 1.926107 2.72989
H  -5.219601 4.443154 -0.635809
H  -2.192828 1.718342 -1.776864
H  0.468976 -0.17892 -0.911969
H  2.440603 -1.094291 -0.472482
H  2.240115 3.097434 -1.398464
H  4.865443 -0.914206 -0.186394
H  4.648147 3.266054 -1.103252
elementType: F O N C H
totalener: -1892.95614090 hartree
nucrepener: 3632.03665104 hartree
electener: -5524.99279194 hartree
oneelecener: -9817.29974343 hartree
twoeener: 4292.30695149 hartree
cpcmener: -0.05606699 hartree
kineticenergy: 1885.77673190 hartree
xcener: -170.267185191980 hartree
chargesum: -0.0000000
charge: -0.181866 -0.184052 -0.183237 -0.167010 -0.175413 -0.174292 -0.316674 -0.559586 -0.226499 -0.042621 -0.161640 -0.131246 -0.042060 0.168441 -0.001802 -0.067967 -0.171285 -0.052886 -0.178684 -0.128340 -0.138130 -0.124535 -0.154966 0.546340 -0.186010 -0.180563 0.188927 0.210987 0.438673 -0.229329 -0.234615 0.175203 -0.128815 -0.141820 -0.105234 0.590734 0.134011 0.114059 0.132420 0.148735 0.151628 0.152464 0.152995 0.162676 0.158664 0.158643 0.179983 0.193953 0.142438 0.157220 0.156463 0.155521
qa: -0.1819 -0.1841 -0.1832 -0.1670 -0.1754 -0.1743 -0.3167 -0.5596 -0.2265 -0.0426 -0.1616 -0.1312 -0.0421 0.1684 -0.0018 -0.0680 -0.1713 -0.0529 -0.1787 -0.1283 -0.1381 -0.1245 -0.1550 0.5463 -0.1860 -0.1806 0.1889 0.2110 0.4387 -0.2293 -0.2346 0.1752 -0.1288 -0.1418 -0.1052 0.5907 0.1340 0.1141 0.1324 0.1487 0.1516 0.1525 0.1530 0.1627 0.1587 0.1586 0.1800 0.1940 0.1424 0.1572 0.1565 0.1555
va: 1.1198 1.1039 1.1131 1.1381 1.1238 1.1249 2.0733 1.9456 3.0000 3.1808 3.2257 3.1230 3.7721 3.7962 3.7178 3.7161 4.0457 3.7488 3.9689 3.9033 3.9194 3.9432 3.9331 4.4316 4.0093 4.0128 3.5939 3.8023 4.3123 3.9633 3.9645 3.7438 4.0166 4.0378 4.0113 4.6151 1.0061 1.0093 1.0362 1.0034 0.9970 1.0000 1.0052 0.9916 1.0030 1.0024 1.0321 1.0144 1.0098 1.0333 0.9992 1.0001
dispcorr: -0.025268294 hartree
energy: -1892.981409193444
dipole: -44.46661 41.10644 -3.36017 7.92808 -11.46477 -3.53670 -18.15661 15.67822 -2.47840
magnitude: 5.47187 au
magnitude: 13.90840 debye
