program: Orca
programVersion: 5.0.2
elementType: F F F F F F O O N N N N C C C C C C C C C C C C C C C C C C C C C C C C H H H H H H H H H H H H H H H H
charge: 0
multiplicity: 1
keywords: wb97x-d3
keywords: def2-TZVPP
keywords: def2/J RIJCOSX
keywords: DEFGRID2
keywords: scfconv7
keywords: smallprint printgap noloewdin
keywords: NOSOSCF
formula: C24H16F6N4O2
InChI: InChI=1/C24H16F6N4O2/c25-23(26,27)18-3-1-2-17(13-18)21(12-15-4-6-16(14-31)7-5-15)33-34-22(35)32-19-8-10-20(11-9-19)36-24(28,29)30/h1-11,13,32,34H,12H2
52 atoms
F  -5.216902 -3.417479 -0.122504
F  -3.677761 -4.519583 0.890127
F  -4.134764 -4.955737 -1.167336
F  9.520397 1.232375 -0.389362
F  8.02901 -0.273748 -0.010866
F  8.330453 1.304178 1.405203
O  7.455309 1.803537 -0.581856
O  1.598521 3.07492 2.214782
N  -0.448833 0.728175 0.713594
N  -0.06913 1.752687 1.483256
N  2.028331 1.497975 0.601596
N  -8.702019 0.586883 -1.975599
C  -2.796582 0.800129 1.519643
C  -1.642335 0.280038 0.699187
C  -1.869151 -0.867718 -0.2048
C  -4.10098 0.788348 0.767963
C  -2.764846 -1.869723 0.147541
C  -2.997936 -2.938351 -0.708979
C  -1.197363 -0.962403 -1.424049
C  -5.228125 0.186405 1.317993
C  -4.190802 1.3665 -0.497023
C  -2.331303 -3.027352 -1.921647
C  -1.424583 -2.034706 -2.268387
C  -4.001196 -3.961992 -0.285572
C  -6.419628 0.134364 0.616964
C  -5.373311 1.324658 -1.210831
C  -6.489597 0.699019 -0.654732
C  3.393453 1.635201 0.36792
C  1.240012 2.169718 1.474891
C  4.22054 2.581802 0.973131
C  3.949186 0.747683 -0.558224
C  6.102147 1.721276 -0.243081
C  5.573743 2.615712 0.666825
C  5.294944 0.786128 -0.866943
C  -7.710191 0.637926 -1.387674
C  8.308837 1.025289 0.100795
H  -2.887738 0.203606 2.431989
H  -2.605025 1.824024 1.84939
H  -3.271937 -1.825604 1.103009
H  -0.5054 -0.18475 -1.719223
H  -5.169699 -0.265063 2.30028
H  -3.32388 1.843939 -0.937412
H  -2.506705 -3.847587 -2.603522
H  -0.902607 -2.094283 -3.213662
H  -7.287241 -0.34564 1.048846
H  -5.432769 1.766717 -2.196093
H  -0.690768 2.221289 2.13287
H  1.563166 0.768276 0.075613
H  3.834914 3.296814 1.680267
H  3.318359 0.013567 -1.045017
H  6.204493 3.359804 1.13533
H  5.698639 0.098194 -1.597761
elementType: F O N C H
totalener: -1892.95543152 hartree
nucrepener: 3587.20906011 hartree
electener: -5480.16449162 hartree
oneelecener: -9727.30125654 hartree
twoeener: 4247.13676492 hartree
cpcmener: -0.05767452 hartree
kineticenergy: 1885.76698548 hartree
xcener: -170.265796656056 hartree
chargesum: -0.0000000
charge: -0.182447 -0.185194 -0.180965 -0.167068 -0.174886 -0.175256 -0.315783 -0.559895 -0.242590 -0.032467 -0.158943 -0.130965 -0.038132 0.194326 0.004818 0.004132 -0.202530 -0.069178 -0.186985 -0.154827 -0.170861 -0.116101 -0.147406 0.548233 -0.186779 -0.166883 0.185262 0.206820 0.439295 -0.237099 -0.224399 0.173522 -0.139212 -0.128839 -0.104198 0.589794 0.121161 0.114276 0.153617 0.142618 0.149500 0.151252 0.154379 0.162048 0.156281 0.159006 0.166301 0.187754 0.157198 0.145354 0.156082 0.156859
qa: -0.1824 -0.1852 -0.1810 -0.1671 -0.1749 -0.1753 -0.3158 -0.5599 -0.2426 -0.0325 -0.1589 -0.1310 -0.0381 0.1943 0.0048 0.0041 -0.2025 -0.0692 -0.1870 -0.1548 -0.1709 -0.1161 -0.1474 0.5482 -0.1868 -0.1669 0.1853 0.2068 0.4393 -0.2371 -0.2244 0.1735 -0.1392 -0.1288 -0.1042 0.5898 0.1212 0.1143 0.1536 0.1426 0.1495 0.1513 0.1544 0.1620 0.1563 0.1590 0.1663 0.1878 0.1572 0.1454 0.1561 0.1569
va: 1.1089 1.1106 1.1229 1.1380 1.1240 1.1241 2.0737 1.9450 2.9906 3.1728 3.2187 3.1249 3.8056 3.7305 3.6706 3.6583 4.0162 3.7573 3.9890 3.9125 3.9197 3.9166 3.9492 4.4397 3.9866 3.9787 3.5973 3.8036 4.3224 3.9678 3.9598 3.7451 4.0406 4.0102 4.0109 4.6157 1.0055 1.0065 1.0190 1.0158 1.0011 0.9980 1.0035 0.9911 1.0030 1.0020 1.0356 1.0209 1.0328 1.0047 0.9999 0.9985
dispcorr: -0.026100010 hartree
energy: -1892.981531526802
dipole: -24.99678 25.01147 0.01469 16.48781 -16.83336 -0.34555 -0.23875 0.49502 0.25627
magnitude: 0.43046 au
magnitude: 1.09415 debye
