program: Orca
programVersion: 5.0.2
elementType: F F F F F F O O N N N N C C C C C C C C C C C C C C C C C C C C C C C C H H H H H H H H H H H H H H H H
charge: 0
multiplicity: 1
keywords: wb97x-d3
keywords: def2-TZVPP
keywords: def2/J RIJCOSX
keywords: DEFGRID2
keywords: scfconv7
keywords: smallprint printgap noloewdin
keywords: NOSOSCF
formula: C24H16F6N4O2
InChI: InChI=1/C24H16F6N4O2/c25-23(26,27)18-3-1-2-17(13-18)21(12-15-4-6-16(14-31)7-5-15)33-34-22(35)32-19-8-10-20(11-9-19)36-24(28,29)30/h1-11,13,32,34H,12H2
52 atoms
F  -0.071013 -5.508383 0.63285
F  -1.465423 -5.247842 2.243838
F  -0.063532 -3.685499 1.771609
F  8.172027 1.727053 0.552706
F  6.657133 0.485481 1.446375
F  6.356063 2.602399 1.310223
O  6.360908 1.397955 -0.562633
O  0.041494 2.839162 -1.738374
N  -1.559561 -0.187224 -1.23571
N  -1.370493 1.104109 -1.522856
N  0.856354 0.79485 -1.080979
N  -5.392849 5.133924 2.78877
C  -3.976502 0.054078 -1.617481
C  -2.724981 -0.708814 -1.26655
C  -2.787166 -2.141821 -0.911121
C  -4.280854 1.165573 -0.640895
C  -1.833069 -2.680879 -0.044227
C  -1.861076 -4.025213 0.28003
C  -3.763119 -2.983742 -1.437016
C  -4.259738 0.933463 0.733733
C  -4.603076 2.437485 -1.107007
C  -2.828266 -4.865523 -0.266177
C  -3.774022 -4.336287 -1.124353
C  -0.863668 -4.607451 1.231431
C  -4.547275 1.949558 1.625592
C  -4.89507 3.464522 -0.227211
C  -4.864111 3.219793 1.143697
C  2.223963 1.02579 -0.95821
C  -0.115153 1.658503 -1.46206
C  3.015608 -0.091103 -0.676183
C  2.838438 2.27127 -1.09255
C  4.973273 1.26751 -0.662267
C  4.384616 0.022215 -0.529628
C  4.212177 2.385065 -0.940854
C  -5.153422 4.274778 2.056744
C  6.866289 1.550246 0.669607
H  -3.892128 0.466643 -2.62729
H  -4.831414 -0.62138 -1.641088
H  -1.083572 -2.02663 0.378817
H  -4.516462 -2.60196 -2.11318
H  -4.014566 -0.049111 1.117515
H  -4.6183 2.629856 -2.172587
H  -2.852176 -5.920508 -0.024924
H  -4.530461 -4.978768 -1.553605
H  -4.525218 1.763437 2.690758
H  -5.138877 4.450093 -0.59976
H  -2.11816 1.721425 -1.819374
H  0.552575 -0.155761 -0.90907
H  2.553118 -1.065166 -0.57236
H  2.268926 3.159451 -1.307432
H  4.979158 -0.859174 -0.330486
H  4.681359 3.353578 -1.054141
elementType: F O N C H
totalener: -1892.95663060 hartree
nucrepener: 3620.46743082 hartree
electener: -5513.42406142 hartree
oneelecener: -9794.14260178 hartree
twoeener: 4280.71854036 hartree
cpcmener: -0.05614795 hartree
kineticenergy: 1885.76946497 hartree
xcener: -170.265397822198 hartree
chargesum: -0.0000000
charge: -0.186317 -0.186012 -0.181823 -0.166965 -0.175964 -0.174607 -0.315531 -0.559962 -0.230147 -0.039796 -0.161917 -0.130697 -0.043672 0.173250 -0.008757 -0.063923 -0.141906 -0.075843 -0.167432 -0.130308 -0.138806 -0.140584 -0.161270 0.554809 -0.186897 -0.179832 0.187793 0.207336 0.440170 -0.228295 -0.231384 0.173993 -0.126156 -0.143757 -0.105824 0.590589 0.132271 0.114861 0.136296 0.148092 0.153868 0.153731 0.152638 0.162753 0.158732 0.158593 0.178804 0.191981 0.143982 0.157861 0.156583 0.155400
qa: -0.1863 -0.1860 -0.1818 -0.1670 -0.1760 -0.1746 -0.3155 -0.5600 -0.2301 -0.0398 -0.1619 -0.1307 -0.0437 0.1732 -0.0088 -0.0639 -0.1419 -0.0758 -0.1674 -0.1303 -0.1388 -0.1406 -0.1613 0.5548 -0.1869 -0.1798 0.1878 0.2073 0.4402 -0.2283 -0.2314 0.1740 -0.1262 -0.1438 -0.1058 0.5906 0.1323 0.1149 0.1363 0.1481 0.1539 0.1537 0.1526 0.1628 0.1587 0.1586 0.1788 0.1920 0.1440 0.1579 0.1566 0.1554
va: 1.1073 1.1094 1.1204 1.1383 1.1230 1.1243 2.0742 1.9447 3.0010 3.1783 3.2269 3.1230 3.7760 3.7978 3.7136 3.7029 3.9538 3.7690 3.9648 3.9038 3.9186 3.9833 3.9245 4.4264 4.0110 4.0129 3.5936 3.8034 4.3106 3.9654 3.9616 3.7437 4.0117 4.0413 4.0114 4.6147 1.0074 1.0089 1.0379 1.0034 0.9943 0.9993 1.0041 0.9914 1.0031 1.0024 1.0326 1.0156 1.0065 1.0324 0.9995 0.9999
dispcorr: -0.025092012 hartree
energy: -1892.981722614177
dipole: -43.48413 40.32464 -3.15949 8.42647 -11.82877 -3.40229 -19.18060 16.53077 -2.64983
magnitude: 5.34599 au
magnitude: 13.58843 debye
