program: Orca
programVersion: 5.0.2
elementType: F F F F F F O O N N N N C C C C C C C C C C C C C C C C C C C C C C C C H H H H H H H H H H H H H H H H
charge: 0
multiplicity: 1
keywords: wb97x-d3
keywords: def2-TZVPP
keywords: def2/J RIJCOSX
keywords: DEFGRID2
keywords: scfconv7
keywords: smallprint printgap noloewdin
keywords: NOSOSCF
formula: C24H16F6N4O2
InChI: InChI=1/C24H16F6N4O2/c25-23(26,27)18-3-1-2-17(13-18)21(12-15-4-6-16(14-31)7-5-15)33-34-22(35)32-19-8-10-20(11-9-19)36-24(28,29)30/h1-11,13,32,34H,12H2
52 atoms
F  -1.734588 -3.618352 1.816452
F  -0.068791 -3.568069 0.463798
F  -1.582246 -5.080957 0.247592
F  7.180392 -0.455034 1.80785
F  7.658307 1.613722 1.515528
F  8.950538 0.092427 0.706854
O  7.049013 0.397073 -0.248052
O  1.310803 3.643512 -0.620954
N  -0.968612 1.06056 -0.885846
N  -0.481829 2.302238 -0.820743
N  1.575727 1.368411 -0.442627
N  -8.928451 0.932779 2.317716
C  -3.266307 1.808732 -1.465968
C  -2.18937 0.805659 -1.153441
C  -2.545279 -0.629987 -1.160978
C  -4.503524 1.612892 -0.630284
C  -1.843212 -1.526077 -0.359573
C  -2.153867 -2.878014 -0.375323
C  -3.572476 -1.115128 -1.969979
C  -5.763684 1.675538 -1.217695
C  -4.405914 1.385962 0.74123
C  -3.174691 -3.357034 -1.18668
C  -3.877823 -2.466337 -1.98323
C  -1.388627 -3.790443 0.531283
C  -6.909271 1.511983 -0.460426
C  -5.540756 1.215188 1.511634
C  -6.796805 1.276136 0.908372
C  2.956726 1.210781 -0.36373
C  0.861902 2.506386 -0.624256
C  3.881003 2.255655 -0.366777
C  3.425829 -0.10433 -0.293453
C  5.678868 0.673668 -0.241302
C  5.23951 1.980907 -0.311049
C  4.778912 -0.376837 -0.229026
C  -7.972621 1.087133 1.68988
C  7.685927 0.414455 0.930576
H  -2.918876 2.833409 -1.323448
H  -3.522513 1.737196 -2.526358
H  -1.057051 -1.152062 0.283947
H  -4.130992 -0.446647 -2.611768
H  -5.850543 1.847248 -2.282985
H  -3.434606 1.336384 1.218406
H  -3.432432 -4.406779 -1.207998
H  -4.67016 -2.830184 -2.622775
H  -7.883898 1.56005 -0.926751
H  -5.457299 1.033193 2.574404
H  -1.047023 3.129182 -0.977849
H  1.036848 0.511434 -0.471402
H  3.565797 3.28406 -0.416766
H  2.720577 -0.926774 -0.293625
H  5.945137 2.800463 -0.339273
H  5.123905 -1.401548 -0.189645
elementType: F O N C H
totalener: -1892.95659391 hartree
nucrepener: 3599.26533907 hartree
electener: -5492.22193298 hartree
oneelecener: -9751.50726707 hartree
twoeener: 4259.28533408 hartree
cpcmener: -0.05752368 hartree
kineticenergy: 1885.76490341 hartree
xcener: -170.265492753834 hartree
chargesum: 0.0000000
charge: -0.184818 -0.184661 -0.181567 -0.175419 -0.175702 -0.167833 -0.314459 -0.559913 -0.228163 -0.027254 -0.161634 -0.131393 -0.030294 0.174282 -0.025383 -0.009207 -0.167327 -0.062137 -0.181020 -0.152739 -0.151849 -0.118650 -0.156182 0.550012 -0.173202 -0.178120 0.179931 0.206621 0.439498 -0.238363 -0.220926 0.173186 -0.132399 -0.136044 -0.102637 0.589987 0.108127 0.120462 0.131403 0.154949 0.148403 0.152471 0.153950 0.162387 0.157644 0.158628 0.163999 0.191411 0.157411 0.142505 0.155192 0.156835
qa: -0.1848 -0.1847 -0.1816 -0.1754 -0.1757 -0.1678 -0.3145 -0.5599 -0.2282 -0.0273 -0.1616 -0.1314 -0.0303 0.1743 -0.0254 -0.0092 -0.1673 -0.0621 -0.1810 -0.1527 -0.1518 -0.1186 -0.1562 0.5500 -0.1732 -0.1781 0.1799 0.2066 0.4395 -0.2384 -0.2209 0.1732 -0.1324 -0.1360 -0.1026 0.5900 0.1081 0.1205 0.1314 0.1549 0.1484 0.1525 0.1539 0.1624 0.1576 0.1586 0.1640 0.1914 0.1574 0.1425 0.1552 0.1568
va: 1.1053 1.1115 1.1214 1.1235 1.1232 1.1368 2.0750 1.9447 2.9850 3.1712 3.2205 3.1239 3.8228 3.7533 3.7258 3.6909 4.0501 3.7624 3.9512 3.9351 3.8980 3.9301 3.9517 4.4330 4.0001 3.9906 3.5971 3.8086 4.3184 3.9705 3.9545 3.7440 4.0320 4.0225 4.0096 4.6154 1.0101 1.0057 1.0394 0.9994 1.0008 0.9981 1.0043 0.9919 1.0027 1.0026 1.0389 1.0152 1.0338 1.0087 1.0020 0.9977
dispcorr: -0.025301329 hartree
energy: -1892.981895240885
dipole: -42.21674 40.42252 -1.79422 18.54590 -18.64048 -0.09457 -17.52420 14.57183 -2.95237
magnitude: 3.45610 au
magnitude: 8.78472 debye
