program: Orca
programVersion: 5.0.2
elementType: F F F F F F O O N N N N C C C C C C C C C C C C C C C C C C C C C C C C H H H H H H H H H H H H H H H H
charge: 0
multiplicity: 1
keywords: wb97x-d3
keywords: def2-TZVPP
keywords: def2/J RIJCOSX
keywords: DEFGRID2
keywords: scfconv7
keywords: smallprint printgap noloewdin
keywords: NOSOSCF
formula: C24H16F6N4O2
InChI: InChI=1/C24H16F6N4O2/c25-23(26,27)18-3-1-2-17(13-18)21(12-15-4-6-16(14-31)7-5-15)33-34-22(35)32-19-8-10-20(11-9-19)36-24(28,29)30/h1-11,13,32,34H,12H2
52 atoms
F  -3.595809 -6.684772 -0.416734
F  -4.592756 -5.357106 0.951266
F  -2.75464 -6.311216 1.52391
F  6.730442 3.91524 -1.071075
F  6.833384 1.989817 -2.004925
F  8.509021 2.719461 -0.865897
O  6.758608 2.100636 0.219837
O  0.392634 2.708335 1.89002
N  -0.941513 -0.293096 0.805983
N  -0.870515 0.928657 1.344723
N  1.352232 0.930196 0.796634
N  -5.396848 5.103277 -2.329095
C  -3.361335 -0.401692 1.247388
C  -2.043761 -0.933907 0.746249
C  -1.964341 -2.257015 0.093196
C  -3.825462 0.799415 0.456582
C  -2.730821 -3.32717 0.544766
C  -2.612864 -4.575331 -0.054799
C  -1.092499 -2.456533 -0.978688
C  -4.31027 1.927336 1.113527
C  -3.777984 0.796086 -0.936897
C  -1.742205 -4.767239 -1.119007
C  -0.988171 -3.698161 -1.579409
C  -3.391088 -5.7292 0.495116
C  -4.731212 3.037975 0.403581
C  -4.192004 1.898553 -1.660096
C  -4.66655 3.025086 -0.98789
C  2.687067 1.306564 0.676711
C  0.327559 1.601235 1.375758
C  3.549629 0.349666 0.133975
C  3.206222 2.54633 1.050366
C  5.38845 1.852721 0.336822
C  4.893536 0.616535 -0.03869
C  4.557202 2.81319 0.878006
C  -5.07344 4.172212 -1.728956
C  7.187532 2.671102 -0.914715
H  -4.125261 -1.177035 1.185081
H  -3.286209 -0.136765 2.306204
H  -3.404082 -3.189871 1.381305
H  -0.504399 -1.629284 -1.352835
H  -4.34926 1.942393 2.195535
H  -3.408088 -0.07117 -1.469558
H  -1.64564 -5.731422 -1.599091
H  -0.318787 -3.836423 -2.417352
H  -5.099654 3.911437 0.92425
H  -4.145025 1.890392 -2.740506
H  -1.655304 1.386889 1.795058
H  1.119371 0.01172 0.439457
H  3.162565 -0.619194 -0.157652
H  2.579989 3.314082 1.472365
H  5.547262 -0.142467 -0.447498
H  4.950388 3.773011 1.185916
elementType: F O N C H
totalener: -1892.95632808 hartree
nucrepener: 3559.01045526 hartree
electener: -5451.96678334 hartree
oneelecener: -9670.77094310 hartree
twoeener: 4218.80415976 hartree
cpcmener: -0.05619851 hartree
kineticenergy: 1885.75663340 hartree
xcener: -170.261834855176 hartree
chargesum: 0.0000000
charge: -0.182573 -0.183827 -0.184054 -0.176154 -0.174936 -0.167450 -0.315433 -0.559405 -0.233353 -0.032874 -0.160380 -0.130195 -0.032743 0.171963 0.002320 -0.059493 -0.164599 -0.067297 -0.190456 -0.143488 -0.132553 -0.116962 -0.153256 0.543592 -0.178431 -0.184850 0.187817 0.207107 0.437125 -0.222614 -0.237100 0.174050 -0.132150 -0.136594 -0.107212 0.590120 0.111643 0.128008 0.143079 0.144733 0.152005 0.154972 0.152379 0.162394 0.158643 0.157616 0.175861 0.189633 0.145156 0.157226 0.157357 0.155633
qa: -0.1826 -0.1838 -0.1841 -0.1762 -0.1749 -0.1674 -0.3154 -0.5594 -0.2334 -0.0329 -0.1604 -0.1302 -0.0327 0.1720 0.0023 -0.0595 -0.1646 -0.0673 -0.1905 -0.1435 -0.1326 -0.1170 -0.1533 0.5436 -0.1784 -0.1848 0.1878 0.2071 0.4371 -0.2226 -0.2371 0.1741 -0.1322 -0.1366 -0.1072 0.5901 0.1116 0.1280 0.1431 0.1447 0.1520 0.1550 0.1524 0.1624 0.1586 0.1576 0.1759 0.1896 0.1452 0.1572 0.1574 0.1556
va: 1.1184 1.1158 1.1030 1.1230 1.1238 1.1372 2.0741 1.9456 3.0015 3.1717 3.2208 3.1249 3.7741 3.7953 3.6982 3.6955 4.0216 3.7347 3.9743 3.9267 3.8961 3.9459 3.9482 4.4397 4.0070 4.0145 3.5937 3.8006 4.3164 3.9585 3.9697 3.7430 4.0116 4.0415 4.0135 4.6159 1.0095 1.0076 1.0222 1.0149 0.9998 0.9938 1.0052 0.9911 1.0021 1.0036 1.0316 1.0195 1.0048 1.0326 0.9976 1.0011
dispcorr: -0.025054820 hartree
energy: -1892.981382901996
dipole: -24.00229 22.89075 -1.11154 8.82834 -12.17866 -3.35033 4.23861 -3.62627 0.61234
magnitude: 3.58262 au
magnitude: 9.10629 debye
