program: Orca
programVersion: 5.0.2
elementType: F F F F F F O O N N N N C C C C C C C C C C C C C C C C C C C C C C C C H H H H H H H H H H H H H H H H
charge: 0
multiplicity: 1
keywords: wb97x-d3
keywords: def2-TZVPP
keywords: def2/J RIJCOSX
keywords: DEFGRID2
keywords: scfconv7
keywords: smallprint printgap noloewdin
keywords: NOSOSCF
formula: C24H16F6N4O2
InChI: InChI=1/C24H16F6N4O2/c25-23(26,27)18-3-1-2-17(13-18)21(12-15-4-6-16(14-31)7-5-15)33-34-22(35)32-19-8-10-20(11-9-19)36-24(28,29)30/h1-11,13,32,34H,12H2
52 atoms
F  0.374092 -3.479303 -1.322601
F  -1.003602 -4.937897 -2.102001
F  -0.280229 -5.113003 -0.088134
F  7.26652 -0.659198 0.376329
F  7.469937 1.24466 1.333615
F  8.68142 0.773791 -0.386072
O  6.594076 1.163398 -0.713242
O  0.733923 3.132831 1.609723
N  -1.27817 0.407613 0.937634
N  -0.904052 1.608615 1.374542
N  1.197855 1.11785 0.610796
N  -7.958757 3.684925 -2.674373
C  -3.603146 0.689577 1.721336
C  -2.464509 -0.04276 1.06196
C  -2.700474 -1.392695 0.499707
C  -4.547615 1.347025 0.743634
C  -1.631543 -2.153042 0.014125
C  -1.845528 -3.408863 -0.524974
C  -3.981942 -1.933488 0.428602
C  -4.071449 2.070761 -0.347868
C  -5.923557 1.254671 0.940188
C  -3.1312 -3.941748 -0.587552
C  -4.191812 -3.195158 -0.110823
C  -0.689282 -4.22831 -1.010711
C  -4.945275 2.684397 -1.226806
C  -6.810467 1.861619 0.069695
C  -6.319712 2.577536 -1.020301
C  2.554009 1.204122 0.313592
C  0.398865 2.029129 1.217032
C  3.116322 0.098252 -0.33097
C  3.367376 2.298882 0.608272
C  5.251267 1.159031 -0.345066
C  4.457306 0.070725 -0.661502
C  4.714229 2.268107 0.278407
C  -7.226643 3.191886 -1.934126
C  7.476027 0.638542 0.145101
H  -4.158462 -0.006541 2.352022
H  -3.22795 1.44679 2.415283
H  -0.631547 -1.744918 0.067411
H  -4.841165 -1.381947 0.784233
H  -3.007723 2.163093 -0.527922
H  -6.309261 0.695369 1.783681
H  -3.31285 -4.924291 -1.003095
H  -5.195976 -3.594355 -0.160644
H  -4.563494 3.242495 -2.071248
H  -7.876855 1.776982 0.230717
H  -1.540551 2.264119 1.814923
H  0.742004 0.254821 0.343512
H  2.495035 -0.755311 -0.577205
H  2.972894 3.176277 1.093698
H  4.868169 -0.789272 -1.173861
H  5.334729 3.126354 0.50184
elementType: F O N C H
totalener: -1892.96938131 hartree
nucrepener: 3597.56886118 hartree
electener: -5490.53824249 hartree
oneelecener: -9747.91047485 hartree
twoeener: 4257.37223236 hartree
cpcmener: -0.04766764 hartree
kineticenergy: 1885.76334241 hartree
xcener: -170.265184021323 hartree
chargesum: 0.0000000
charge: -0.181147 -0.183142 -0.182515 -0.175990 -0.174763 -0.166982 -0.309826 -0.523093 -0.219547 -0.055131 -0.168977 -0.113079 -0.033041 0.162593 0.015375 -0.000647 -0.167366 -0.040471 -0.194084 -0.135974 -0.183133 -0.142719 -0.156141 0.538479 -0.180917 -0.160700 0.172300 0.207993 0.422408 -0.222645 -0.233167 0.175926 -0.134184 -0.134651 -0.118196 0.587636 0.118776 0.108711 0.157353 0.144899 0.146069 0.147668 0.149841 0.158420 0.156797 0.155688 0.166121 0.196770 0.142312 0.155922 0.151720 0.152451
qa: -0.1811 -0.1831 -0.1825 -0.1760 -0.1748 -0.1670 -0.3098 -0.5231 -0.2195 -0.0551 -0.1690 -0.1131 -0.0330 0.1626 0.0154 -0.0006 -0.1674 -0.0405 -0.1941 -0.1360 -0.1831 -0.1427 -0.1561 0.5385 -0.1809 -0.1607 0.1723 0.2080 0.4224 -0.2226 -0.2332 0.1759 -0.1342 -0.1347 -0.1182 0.5876 0.1188 0.1087 0.1574 0.1449 0.1461 0.1477 0.1498 0.1584 0.1568 0.1557 0.1661 0.1968 0.1423 0.1559 0.1517 0.1525
va: 1.1165 1.1157 1.1057 1.1229 1.1246 1.1379 2.0829 1.9928 2.9858 3.1780 3.2147 3.1249 3.8053 3.8214 3.7685 3.6851 4.0413 3.7370 3.9844 3.9071 3.9727 3.9796 3.9654 4.4344 4.0469 3.9950 3.6334 3.8132 4.3370 3.9621 3.9715 3.7543 4.0312 4.0352 4.0113 4.6190 1.0060 1.0055 1.0115 1.0072 1.0042 1.0014 1.0064 0.9930 1.0041 1.0030 1.0356 1.0136 1.0081 1.0341 1.0015 1.0009
dispcorr: -0.025191085 hartree
energy: -1892.994572395350
dipole: -47.25968 44.87528 -2.38440 16.02436 -17.75462 -1.73026 7.90099 -6.03255 1.86844
magnitude: 3.48858 au
magnitude: 8.86727 debye
