program: Orca
programVersion: 5.0.2
elementType: F F F F F F O O N N N N C C C C C C C C C C C C C C C C C C C C C C C C H H H H H H H H H H H H H H H H
charge: 0
multiplicity: 1
keywords: wb97x-d3
keywords: def2-TZVPP
keywords: def2/J RIJCOSX
keywords: DEFGRID2
keywords: scfconv7
keywords: smallprint printgap noloewdin
keywords: NOSOSCF
formula: C24H16F6N4O2
InChI: InChI=1/C24H16F6N4O2/c25-23(26,27)18-3-1-2-17(13-18)21(12-15-4-6-16(14-31)7-5-15)33-34-22(35)32-19-8-10-20(11-9-19)36-24(28,29)30/h1-11,13,32,34H,12H2
52 atoms
F  -4.991697 -5.178007 0.344785
F  -3.896996 -6.312763 -1.114754
F  -4.740822 -4.407152 -1.644047
F  7.444123 3.074581 1.195148
F  8.75536 2.768274 -0.484892
F  7.793053 1.090849 0.463221
O  6.644085 2.513598 -0.80515
O  0.491535 2.867195 1.524887
N  -0.782599 -0.285265 0.889514
N  -0.719109 0.993429 1.265843
N  1.461364 1.02719 0.553963
N  -5.844281 4.556782 -2.508615
C  -3.158251 -0.345684 1.491053
C  -1.872711 -0.943853 0.981526
C  -1.805018 -2.363216 0.578908
C  -3.733563 0.728064 0.598639
C  -2.938752 -3.046422 0.150145
C  -2.858221 -4.38244 -0.233002
C  -0.586578 -3.049017 0.617526
C  -4.31366 1.861522 1.163353
C  -3.71577 0.600393 -0.788784
C  -1.646699 -5.053755 -0.18806
C  -0.512035 -4.374631 0.238123
C  -4.114899 -5.07471 -0.664657
C  -4.866092 2.849749 0.369106
C  -4.261481 1.581057 -1.596624
C  -4.838934 2.709788 -1.017056
C  2.74985 1.467712 0.264186
C  0.446492 1.713141 1.135218
C  3.224478 2.758392 0.503086
C  3.607623 0.533279 -0.323143
C  5.358433 2.150432 -0.411692
C  4.527386 3.091444 0.163933
C  4.905259 0.866918 -0.660814
C  -5.395553 3.729368 -1.844445
C  7.631985 2.360559 0.084165
H  -3.906011 -1.125705 1.639474
H  -2.986776 0.067016 2.490915
H  -3.890937 -2.5325 0.098571
H  0.303984 -2.542746 0.965026
H  -4.328346 1.978331 2.240024
H  -3.269155 -0.269984 -1.253685
H  -1.566597 -6.0940 -0.471658
H  0.435787 -4.894153 0.283461
H  -5.30892 3.727809 0.819795
H  -4.238902 1.473873 -2.672868
H  -1.492751 1.48179 1.703143
H  1.253268 0.070585 0.296975
H  2.597662 3.513669 0.946683
H  3.252159 -0.470972 -0.521764
H  4.877913 4.100302 0.339635
H  5.546446 0.131608 -1.12929
elementType: F O N C H
totalener: -1892.97001691 hartree
nucrepener: 3560.08326436 hartree
electener: -5453.05328127 hartree
oneelecener: -9672.96954294 hartree
twoeener: 4219.91626167 hartree
cpcmener: -0.04695555 hartree
kineticenergy: 1885.76623992 hartree
xcener: -170.263348313678 hartree
chargesum: -0.0000000
charge: -0.183406 -0.180235 -0.184202 -0.174673 -0.166386 -0.175865 -0.309789 -0.525324 -0.242695 -0.031766 -0.161617 -0.113470 -0.029418 0.164151 0.047590 -0.073941 -0.190320 -0.090198 -0.189645 -0.163385 -0.112630 -0.103847 -0.143809 0.549549 -0.168238 -0.188332 0.183706 0.205570 0.423650 -0.231638 -0.224126 0.171037 -0.132596 -0.128850 -0.114258 0.586939 0.108445 0.130408 0.139977 0.144099 0.146925 0.150242 0.152898 0.158430 0.155996 0.156445 0.169589 0.183724 0.158318 0.141016 0.152528 0.153428
qa: -0.1834 -0.1802 -0.1842 -0.1747 -0.1664 -0.1759 -0.3098 -0.5253 -0.2427 -0.0318 -0.1616 -0.1135 -0.0294 0.1642 0.0476 -0.0739 -0.1903 -0.0902 -0.1896 -0.1634 -0.1126 -0.1038 -0.1438 0.5495 -0.1682 -0.1883 0.1837 0.2056 0.4236 -0.2316 -0.2241 0.1710 -0.1326 -0.1289 -0.1143 0.5869 0.1084 0.1304 0.1400 0.1441 0.1469 0.1502 0.1529 0.1584 0.1560 0.1564 0.1696 0.1837 0.1583 0.1410 0.1525 0.1534
va: 1.1101 1.1236 1.1133 1.1248 1.1389 1.1231 2.0831 1.9875 2.9927 3.1729 3.2239 3.1241 3.7674 3.7803 3.6823 3.7349 4.0556 3.8020 4.0101 3.9757 3.8795 3.9234 3.9519 4.4398 4.0025 4.0379 3.6151 3.8130 4.3297 3.9694 3.9647 3.7601 4.0343 4.0215 4.0076 4.6203 1.0093 1.0003 1.0230 1.0162 1.0016 0.9992 1.0044 0.9933 1.0033 1.0046 1.0365 1.0223 1.0331 1.0057 1.0015 0.9996
dispcorr: -0.025018914 hartree
energy: -1892.995035821737
dipole: -21.41805 20.99595 -0.42210 6.99012 -10.27755 -3.28743 6.50514 -4.87179 1.63335
magnitude: 3.69503 au
magnitude: 9.39202 debye
