program: Orca
programVersion: 5.0.2
elementType: F F F F F F O O N N N N C C C C C C C C C C C C C C C C C C C C C C C C H H H H H H H H H H H H H H H H
charge: 0
multiplicity: 1
keywords: wb97x-d3
keywords: def2-TZVPP
keywords: def2/J RIJCOSX
keywords: DEFGRID2
keywords: scfconv7
keywords: smallprint printgap noloewdin
keywords: NOSOSCF
formula: C24H16F6N4O2
InChI: InChI=1/C24H16F6N4O2/c25-23(26,27)18-3-1-2-17(13-18)21(12-15-4-6-16(14-31)7-5-15)33-34-22(35)32-19-8-10-20(11-9-19)36-24(28,29)30/h1-11,13,32,34H,12H2
52 atoms
F  -0.710867 -6.180076 1.142254
F  0.481987 -4.604887 0.29361
F  -0.743969 -5.824844 -0.97949
F  6.29275 3.224611 1.10055
F  8.065566 2.010311 0.94419
F  6.362778 1.310685 2.061671
O  6.331729 1.391755 -0.164127
O  0.158226 2.368545 -2.243937
N  -1.549588 -0.3396 -0.9396
N  -1.320011 0.822813 -1.552819
N  0.883782 0.610775 -0.957537
N  -5.487442 5.792062 1.804904
C  -3.959017 -0.113038 -1.363271
C  -2.73089 -0.812303 -0.839926
C  -2.837255 -2.128575 -0.180723
C  -4.275128 1.183742 -0.657279
C  -1.776232 -3.029385 -0.259239
C  -1.84571 -4.257721 0.380165
C  -3.971678 -2.491097 0.545012
C  -4.148847 1.300241 0.725675
C  -4.720488 2.283058 -1.387926
C  -2.975781 -4.60901 1.109669
C  -4.033432 -3.717029 1.188368
C  -0.706822 -5.216804 0.216338
C  -4.462222 2.483817 1.368159
C  -5.038045 3.473718 -0.760009
C  -4.908518 3.575126 0.623838
C  2.242137 0.87359 -0.80338
C  -0.045648 1.338904 -1.625246
C  2.878211 2.043563 -1.221259
C  2.999471 -0.115396 -0.16891
C  4.959217 1.231192 -0.347883
C  4.235045 2.215724 -0.990637
C  4.35064 0.058295 0.062382
C  -5.228956 4.800677 1.278449
C  6.742309 1.974481 0.966814
H  -3.83412 0.076757 -2.435031
H  -4.822202 -0.777057 -1.295916
H  -0.904092 -2.762619 -0.842216
H  -4.810594 -1.812082 0.632393
H  -3.798398 0.462483 1.315966
H  -4.816463 2.210491 -2.464343
H  -3.046017 -5.564257 1.611858
H  -4.914096 -3.979961 1.758962
H  -4.359182 2.564122 2.442036
H  -5.379698 4.321375 -1.339051
H  -2.034813 1.328633 -2.064192
H  0.543826 -0.238887 -0.524638
H  2.335158 2.829121 -1.719695
H  2.524201 -1.035009 0.151242
H  4.719498 3.121917 -1.330342
H  4.921192 -0.724247 0.545256
elementType: F O N C H
totalener: -1892.97002803 hartree
nucrepener: 3603.06305158 hartree
electener: -5496.03307961 hartree
oneelecener: -9759.27750916 hartree
twoeener: 4263.24442955 hartree
cpcmener: -0.04727636 hartree
kineticenergy: 1885.76473725 hartree
xcener: -170.262062102832 hartree
chargesum: 0.0000000
charge: -0.180690 -0.183658 -0.182321 -0.175752 -0.166901 -0.176295 -0.309169 -0.524207 -0.245937 -0.031336 -0.163851 -0.113224 -0.040807 0.176678 0.055889 -0.062338 -0.191432 -0.060865 -0.195209 -0.116437 -0.162219 -0.113449 -0.169002 0.546616 -0.191882 -0.168252 0.184895 0.208677 0.421030 -0.230451 -0.222642 0.171380 -0.133662 -0.128415 -0.114370 0.587488 0.128083 0.111290 0.133238 0.151171 0.153370 0.146146 0.151891 0.159822 0.155268 0.156401 0.169734 0.184619 0.156578 0.138485 0.152707 0.153320
qa: -0.1807 -0.1837 -0.1823 -0.1758 -0.1669 -0.1763 -0.3092 -0.5242 -0.2459 -0.0313 -0.1639 -0.1132 -0.0408 0.1767 0.0559 -0.0623 -0.1914 -0.0609 -0.1952 -0.1164 -0.1622 -0.1134 -0.1690 0.5466 -0.1919 -0.1683 0.1849 0.2087 0.4210 -0.2305 -0.2226 0.1714 -0.1337 -0.1284 -0.1144 0.5875 0.1281 0.1113 0.1332 0.1512 0.1534 0.1461 0.1519 0.1598 0.1553 0.1564 0.1697 0.1846 0.1566 0.1385 0.1527 0.1533
va: 1.1220 1.1145 1.1069 1.1235 1.1379 1.1224 2.0834 1.9889 2.9863 3.1697 3.2200 3.1242 3.7754 3.7643 3.6682 3.7287 4.0882 3.7723 3.9693 3.8782 3.9735 3.9429 3.9749 4.4352 4.0484 4.0018 3.6124 3.8013 4.3341 3.9705 3.9663 3.7595 4.0356 4.0217 4.0076 4.6200 1.0011 1.0067 1.0390 0.9980 0.9975 1.0016 1.0054 0.9931 1.0053 1.0031 1.0349 1.0227 1.0328 1.0086 1.0014 0.9994
dispcorr: -0.025093906 hartree
energy: -1892.995121933714
dipole: -44.11394 40.93076 -3.18318 9.55776 -12.68551 -3.12776 -9.37000 8.62065 -0.74935
magnitude: 4.52516 au
magnitude: 11.50203 debye
