program: Orca
programVersion: 5.0.2
elementType: F F F F F F O O N N N N C C C C C C C C C C C C C C C C C C C C C C C C H H H H H H H H H H H H H H H H
charge: 0
multiplicity: 1
keywords: wb97x-d3
keywords: def2-TZVPP
keywords: def2/J RIJCOSX
keywords: DEFGRID2
keywords: scfconv7
keywords: smallprint printgap noloewdin
keywords: NOSOSCF
formula: C24H16F6N4O2
InChI: InChI=1/C24H16F6N4O2/c25-23(26,27)18-3-1-2-17(13-18)21(12-15-4-6-16(14-31)7-5-15)33-34-22(35)32-19-8-10-20(11-9-19)36-24(28,29)30/h1-11,13,32,34H,12H2
52 atoms
F  -0.57465 -5.847891 1.31956
F  0.590853 -4.143414 0.714303
F  -0.155756 -5.51376 -0.762307
F  7.066799 2.038612 -0.881153
F  7.013818 0.022346 -0.163516
F  8.249723 1.480237 0.831524
O  6.124801 1.630052 1.093994
O  0.148988 2.851886 -1.446466
N  -1.536984 -0.09586 -0.797866
N  -1.299269 1.141922 -1.23311
N  0.813744 0.929227 -0.379737
N  -6.244115 5.465603 1.848778
C  -3.849288 0.027428 -1.60455
C  -2.676077 -0.651141 -0.947073
C  -2.785775 -2.03109 -0.432713
C  -4.374369 1.214839 -0.833679
C  -1.637184 -2.806645 -0.27102
C  -1.717443 -4.083256 0.259805
C  -4.014446 -2.575985 -0.063802
C  -4.511214 1.168563 0.55259
C  -4.740448 2.376658 -1.509121
C  -2.947369 -4.620247 0.625883
C  -4.090855 -3.857679 0.45997
C  -0.466841 -4.896098 0.387117
C  -4.997949 2.257517 1.251613
C  -5.229487 3.473994 -0.824078
C  -5.356558 3.415391 0.562236
C  2.142428 1.179964 -0.053344
C  -0.065298 1.72365 -1.038886
C  2.833525 0.13307 0.564415
C  2.809642 2.382989 -0.286686
C  4.804645 1.467611 0.680583
C  4.157555 0.270775 0.931164
C  4.140907 2.518795 0.079801
C  -5.848707 4.547598 1.276177
C  7.086433 1.295991 0.227887
H  -3.556756 0.346422 -2.610527
H  -4.659201 -0.685898 -1.761921
H  -0.682265 -2.397895 -0.573771
H  -4.925083 -1.999657 -0.162142
H  -4.231626 0.2774 1.10125
H  -4.63461 2.428308 -2.585817
H  -3.026193 -5.618706 1.034493
H  -5.05179 -4.263042 0.746934
H  -5.095991 2.213527 2.328078
H  -5.504656 4.372915 -1.359377
H  -1.985833 1.699363 -1.729131
H  0.460547 0.016129 -0.121888
H  2.328567 -0.806097 0.758631
H  2.311701 3.219377 -0.748823
H  4.671033 -0.547937 1.418209
H  4.646171 3.460023 -0.09502
elementType: F O N C H
totalener: -1892.96978446 hartree
nucrepener: 3611.29948430 hartree
electener: -5504.26926875 hartree
oneelecener: -9775.68347903 hartree
twoeener: 4271.41421027 hartree
cpcmener: -0.04705692 hartree
kineticenergy: 1885.78809774 hartree
xcener: -170.267701197377 hartree
chargesum: -0.0000000
charge: -0.181284 -0.182264 -0.182104 -0.175839 -0.175678 -0.166969 -0.309348 -0.523788 -0.238536 -0.037113 -0.163440 -0.112927 -0.044521 0.167317 0.048371 -0.065363 -0.183545 -0.053248 -0.193447 -0.111597 -0.163264 -0.119403 -0.165170 0.545270 -0.192653 -0.167143 0.185980 0.209904 0.421307 -0.223822 -0.232230 0.171999 -0.128585 -0.133552 -0.115451 0.588625 0.130616 0.110203 0.133989 0.147586 0.152552 0.147960 0.151722 0.159198 0.155877 0.156522 0.171673 0.186733 0.137852 0.156376 0.152558 0.152096
qa: -0.1813 -0.1823 -0.1821 -0.1758 -0.1757 -0.1670 -0.3093 -0.5238 -0.2385 -0.0371 -0.1634 -0.1129 -0.0445 0.1673 0.0484 -0.0654 -0.1835 -0.0532 -0.1934 -0.1116 -0.1633 -0.1194 -0.1652 0.5453 -0.1927 -0.1671 0.1860 0.2099 0.4213 -0.2238 -0.2322 0.1720 -0.1286 -0.1336 -0.1155 0.5886 0.1306 0.1102 0.1340 0.1476 0.1526 0.1480 0.1517 0.1592 0.1559 0.1565 0.1717 0.1867 0.1379 0.1564 0.1526 0.1521
va: 1.1202 1.1148 1.1063 1.1235 1.1230 1.1381 2.0835 1.9902 2.9962 3.1766 3.2211 3.1248 3.7773 3.7875 3.6924 3.7285 4.0860 3.7646 3.9729 3.8802 3.9686 3.9521 3.9665 4.4318 4.0458 4.0037 3.6115 3.8070 4.3344 3.9639 3.9742 3.7586 4.0206 4.0377 4.0079 4.6187 1.0017 1.0072 1.0355 1.0005 0.9973 1.0012 1.0057 0.9929 1.0050 1.0031 1.0355 1.0203 1.0105 1.0334 0.9999 1.0016
dispcorr: -0.025269782 hartree
energy: -1892.995054239037
dipole: -47.67236 44.64258 -3.02978 12.84539 -15.86161 -3.01622 -5.12021 3.88410 -1.23611
magnitude: 4.45029 au
magnitude: 11.31175 debye
