program: Orca
programVersion: 5.0.2
elementType: F F F F F F O O N N N N C C C C C C C C C C C C C C C C C C C C C C C C H H H H H H H H H H H H H H H H
charge: 0
multiplicity: 1
keywords: wb97x-d3
keywords: def2-TZVPP
keywords: def2/J RIJCOSX
keywords: DEFGRID2
keywords: scfconv7
keywords: smallprint printgap noloewdin
keywords: NOSOSCF
formula: C24H16F6N4O2
InChI: InChI=1/C24H16F6N4O2/c25-23(26,27)18-3-1-2-17(13-18)21(12-15-4-6-16(14-31)7-5-15)33-34-22(35)32-19-8-10-20(11-9-19)36-24(28,29)30/h1-11,13,32,34H,12H2
52 atoms
F  -3.802517 -6.127621 -0.901314
F  -5.01841 -4.702473 0.152277
F  -3.424144 -5.711766 1.177177
F  8.809685 2.507463 -0.874814
F  7.011925 3.684935 -1.038293
F  7.119115 1.763194 -1.981374
O  7.090613 1.868264 0.244427
O  0.90851 2.640886 2.404191
N  -0.72512 -0.090071 1.053537
N  -0.520166 1.042203 1.728479
N  1.676525 0.925289 1.086211
N  -6.541304 3.819262 -2.784344
C  -3.12501 -0.153648 1.661368
C  -1.863397 -0.661761 1.004854
C  -1.923278 -1.86898 0.150908
C  -3.892447 0.720294 0.699985
C  -2.781574 -2.922169 0.444779
C  -2.821727 -4.049809 -0.36779
C  -1.10527 -1.969472 -0.978014
C  -4.625816 0.149569 -0.340144
C  -3.86034 2.107094 0.820208
C  -2.002653 -4.144677 -1.482098
C  -1.144129 -3.094731 -1.779625
C  -3.762863 -5.150851 0.007069
C  -5.307131 0.942166 -1.244222
C  -4.54132 2.913885 -0.074225
C  -5.263627 2.329918 -1.112564
C  3.022273 1.234948 0.913162
C  0.732225 1.610637 1.777385
C  3.791161 0.290812 0.226418
C  3.637773 2.403634 1.364256
C  5.723912 1.671217 0.431533
C  5.134557 0.501859 -0.015681
C  4.986754 2.615568 1.11825
C  -5.970529 3.153809 -2.03727
C  7.487197 2.44574 -0.894255
H  -3.749509 -0.991696 1.969281
H  -2.90736 0.395786 2.579254
H  -3.417437 -2.874402 1.31959
H  -0.447059 -1.151015 -1.237813
H  -4.676308 -0.926898 -0.443601
H  -3.307431 2.567538 1.629655
H  -2.02376 -5.013371 -2.125586
H  -0.510431 -3.154132 -2.654387
H  -5.873862 0.489324 -2.046825
H  -4.515099 3.990029 0.032759
H  -1.248592 1.517631 2.248698
H  1.357704 0.070452 0.647292
H  3.330617 -0.625068 -0.12404
H  3.085642 3.15667 1.901706
H  5.713594 -0.250727 -0.534516
H  5.456349 3.52037 1.482177
elementType: F O N C H
totalener: -1892.96888527 hartree
nucrepener: 3558.91325703 hartree
electener: -5451.88214230 hartree
oneelecener: -9670.42580364 hartree
twoeener: 4218.54366134 hartree
cpcmener: -0.04787825 hartree
kineticenergy: 1885.77812677 hartree
xcener: -170.264926452992 hartree
chargesum: 0.0000000
charge: -0.179711 -0.184821 -0.183226 -0.166906 -0.175614 -0.176201 -0.309308 -0.526197 -0.236156 -0.042403 -0.162330 -0.112796 -0.099436 0.186536 0.009336 0.043806 -0.231890 -0.036624 -0.177560 -0.178163 -0.147355 -0.117645 -0.144494 0.553386 -0.181601 -0.181783 0.181183 0.207447 0.424327 -0.223796 -0.229863 0.171087 -0.126341 -0.135947 -0.114838 0.587564 0.130099 0.116035 0.135758 0.143531 0.161648 0.148863 0.153948 0.159698 0.155773 0.155927 0.170367 0.184085 0.140056 0.156561 0.153371 0.152612
qa: -0.1797 -0.1848 -0.1832 -0.1669 -0.1756 -0.1762 -0.3093 -0.5262 -0.2362 -0.0424 -0.1623 -0.1128 -0.0994 0.1865 0.0093 0.0438 -0.2319 -0.0366 -0.1776 -0.1782 -0.1474 -0.1176 -0.1445 0.5534 -0.1816 -0.1818 0.1812 0.2074 0.4243 -0.2238 -0.2299 0.1711 -0.1263 -0.1359 -0.1148 0.5876 0.1301 0.1160 0.1358 0.1435 0.1616 0.1489 0.1539 0.1597 0.1558 0.1559 0.1704 0.1841 0.1401 0.1566 0.1534 0.1526
va: 1.1250 1.1109 1.1107 1.1379 1.1237 1.1225 2.0833 1.9868 3.0056 3.1639 3.2180 3.1251 3.8469 3.7738 3.6788 3.6321 4.0035 3.7132 4.0027 3.9643 3.9545 3.9319 3.9518 4.4359 4.0303 4.0220 3.6233 3.8074 4.3349 3.9660 3.9689 3.7592 4.0178 4.0404 4.0071 4.6198 1.0109 1.0112 1.0377 1.0136 0.9891 1.0025 1.0041 0.9923 1.0044 1.0042 1.0356 1.0233 1.0063 1.0331 0.9998 1.0011
dispcorr: -0.025190742 hartree
energy: -1892.994076010060
dipole: -22.66843 22.06978 -0.59865 8.68345 -11.13773 -2.45427 7.61490 -6.62903 0.98587
magnitude: 2.71179 au
magnitude: 6.89282 debye
