program: Orca
programVersion: 5.0.2
elementType: F F F F F F O O N N N N C C C C C C C C C C C C C C C C C C C C C C C C H H H H H H H H H H H H H H H H
charge: 0
multiplicity: 1
keywords: wb97x-d3
keywords: def2-TZVPP
keywords: def2/J RIJCOSX
keywords: DEFGRID2
keywords: scfconv7
keywords: smallprint printgap noloewdin
keywords: NOSOSCF
formula: C24H16F6N4O2
InChI: InChI=1/C24H16F6N4O2/c25-23(26,27)18-3-1-2-17(13-18)21(12-15-4-6-16(14-31)7-5-15)33-34-22(35)32-19-8-10-20(11-9-19)36-24(28,29)30/h1-11,13,32,34H,12H2
52 atoms
F  -0.251371 -5.513549 0.87167
F  -1.761638 -5.22097 2.366576
F  -0.302198 -3.684499 2.001317
F  8.358749 1.573291 0.244362
F  6.784354 0.635759 1.377024
F  6.729616 2.749756 1.023834
O  6.438208 1.369022 -0.696278
O  0.104409 2.860985 -1.647685
N  -1.51005 -0.165142 -1.179553
N  -1.311397 1.127615 -1.449952
N  0.916085 0.813231 -1.001721
N  -5.689784 4.95212 2.845755
C  -3.904523 0.08853 -1.670294
C  -2.673033 -0.683674 -1.26731
C  -2.767257 -2.11669 -0.916791
C  -4.283201 1.156972 -0.671121
C  -1.909303 -2.656335 0.04489
C  -1.977718 -4.000753 0.368565
C  -3.688026 -2.955475 -1.539288
C  -4.307922 0.878718 0.694501
C  -4.63536 2.431734 -1.106749
C  -2.895291 -4.834176 -0.265785
C  -3.744658 -4.304365 -1.219608
C  -1.072254 -4.595635 1.402226
C  -4.672359 1.850364 1.607013
C  -5.004769 3.414495 -0.205331
C  -5.021954 3.123219 1.156594
C  2.286957 1.037571 -0.90285
C  -0.053505 1.682325 -1.380138
C  3.085844 -0.087979 -0.6813
C  2.899894 2.287033 -1.00889
C  5.049448 1.265567 -0.7022
C  4.459457 0.019685 -0.580241
C  4.279462 2.393371 -0.909219
C  -5.392254 4.130297 2.095526
C  7.053552 1.577994 0.471761
H  -3.758705 0.541745 -2.655833
H  -4.751516 -0.58898 -1.778744
H  -1.206895 -2.002259 0.54301
H  -4.358567 -2.57217 -2.297405
H  -4.04163 -0.106466 1.05713
H  -4.616631 2.663382 -2.164679
H  -2.956664 -5.88668 -0.019467
H  -4.457842 -4.944861 -1.720709
H  -4.686134 1.625774 2.665002
H  -5.272617 4.402341 -0.555596
H  -2.054068 1.753846 -1.740157
H  0.611375 -0.139258 -0.844404
H  2.626514 -1.06562 -0.596121
H  2.323499 3.182597 -1.17084
H  5.060297 -0.867901 -0.431384
H  4.744381 3.365175 -1.014282
elementType: F O N C H
totalener: -1892.96915175 hartree
nucrepener: 3604.17520280 hartree
electener: -5497.14435455 hartree
oneelecener: -9761.59026610 hartree
twoeener: 4264.44591155 hartree
cpcmener: -0.04690369 hartree
kineticenergy: 1885.76614234 hartree
xcener: -170.262544024328 hartree
chargesum: -0.0000000
charge: -0.184387 -0.184455 -0.180705 -0.167293 -0.175067 -0.175816 -0.309082 -0.525712 -0.227405 -0.038982 -0.165719 -0.113039 -0.057411 0.170474 -0.000791 -0.061732 -0.151286 -0.074547 -0.164311 -0.126025 -0.138671 -0.135547 -0.162641 0.553392 -0.185385 -0.177291 0.188639 0.208526 0.425266 -0.223682 -0.231074 0.173551 -0.128481 -0.133723 -0.117279 0.586531 0.129056 0.113972 0.135602 0.146599 0.151591 0.149748 0.150610 0.159692 0.156433 0.156375 0.174161 0.185315 0.140238 0.156734 0.153518 0.151515
qa: -0.1844 -0.1845 -0.1807 -0.1673 -0.1751 -0.1758 -0.3091 -0.5257 -0.2274 -0.0390 -0.1657 -0.1130 -0.0574 0.1705 -0.0008 -0.0617 -0.1513 -0.0745 -0.1643 -0.1260 -0.1387 -0.1355 -0.1626 0.5534 -0.1854 -0.1773 0.1886 0.2085 0.4253 -0.2237 -0.2311 0.1736 -0.1285 -0.1337 -0.1173 0.5865 0.1291 0.1140 0.1356 0.1466 0.1516 0.1497 0.1506 0.1597 0.1564 0.1564 0.1742 0.1853 0.1402 0.1567 0.1535 0.1515
va: 1.1100 1.1119 1.1223 1.1373 1.1239 1.1237 2.0831 1.9870 3.0074 3.1706 3.2225 3.1243 3.7850 3.7915 3.7046 3.7014 3.9563 3.7771 3.9667 3.9046 3.9283 3.9879 3.9345 4.4310 4.0193 4.0170 3.6084 3.8051 4.3280 3.9683 3.9746 3.7576 4.0207 4.0400 4.0100 4.6214 1.0079 1.0081 1.0391 1.0032 0.9948 1.0005 1.0049 0.9928 1.0041 1.0032 1.0352 1.0208 1.0068 1.0327 0.9994 1.0021
dispcorr: -0.024936984 hartree
energy: -1892.994088736996
dipole: -43.12653 40.23959 -2.88694 8.36280 -11.48541 -3.12261 -19.32274 16.62176 -2.70098
magnitude: 5.03790 au
magnitude: 12.80531 debye
