program: Orca
programVersion: 5.0.2
elementType: F F F F F F O O N N N N C C C C C C C C C C C C C C C C C C C C C C C C H H H H H H H H H H H H H H H H
charge: 0
multiplicity: 1
keywords: wb97x-d3
keywords: def2-TZVPP
keywords: def2/J RIJCOSX
keywords: DEFGRID2
keywords: scfconv7
keywords: smallprint printgap noloewdin
keywords: NOSOSCF
formula: C24H16F6N4O2
InChI: InChI=1/C24H16F6N4O2/c25-23(26,27)18-3-1-2-17(13-18)21(12-15-4-6-16(14-31)7-5-15)33-34-22(35)32-19-8-10-20(11-9-19)36-24(28,29)30/h1-11,13,32,34H,12H2
52 atoms
F  -2.897263 -6.004501 1.590907
F  -3.378312 -6.742462 -0.370877
F  -4.679985 -5.333151 0.600229
F  7.454906 2.950423 1.001934
F  8.705749 2.668372 -0.726687
F  7.698391 0.989558 0.170978
O  6.577529 2.51788 -0.997636
O  0.462896 2.823071 1.464368
N  -0.909734 -0.199897 0.492041
N  -0.801632 1.015299 1.034418
N  1.365655 1.070213 0.288319
N  -6.190449 5.012576 -1.771727
C  -3.22852 -0.382956 1.287956
C  -1.989874 -0.873335 0.581818
C  -1.973305 -2.189308 -0.091547
C  -3.861768 0.808115 0.606378
C  -2.683854 -3.270746 0.419357
C  -2.629045 -4.511471 -0.207593
C  -1.216173 -2.372443 -1.251891
C  -4.028516 0.834108 -0.777451
C  -4.310994 1.889142 1.360706
C  -1.870032 -4.68594 -1.354933
C  -1.168048 -3.605935 -1.873428
C  -3.393319 -5.64981 0.396421
C  -4.628603 1.914492 -1.396431
C  -4.914589 2.97738 0.755531
C  -5.07314 2.99064 -0.628259
C  2.665869 1.495931 0.031328
C  0.379554 1.718426 0.95605
C  3.172512 2.756194 0.352239
C  3.500515 0.580077 -0.615568
C  5.289171 2.157898 -0.609489
C  4.483064 3.079011 0.030616
C  4.804504 0.903809 -0.937203
C  -5.688685 4.109543 -1.262394
C  7.581143 2.280895 -0.145046
H  -3.971044 -1.180068 1.337208
H  -2.993571 -0.13064 2.326651
H  -3.267203 -3.153693 1.32451
H  -0.67617 -1.536828 -1.677346
H  -3.690076 0.003997 -1.38538
H  -4.185292 1.883782 2.436532
H  -1.817941 -5.641736 -1.857667
H  -0.585746 -3.730889 -2.776593
H  -4.752134 1.926718 -2.47111
H  -5.255485 3.813186 1.351887
H  -1.549417 1.461257 1.554042
H  1.127653 0.146746 -0.051359
H  2.563766 3.496596 0.844162
H  3.121039 -0.401175 -0.875053
H  4.858051 4.066087 0.268674
H  5.425964 0.185014 -1.455151
elementType: F O N C H
totalener: -1892.96909243 hartree
nucrepener: 3546.04216471 hartree
electener: -5439.01125715 hartree
oneelecener: -9644.89941031 hartree
twoeener: 4205.88815317 hartree
cpcmener: -0.04673038 hartree
kineticenergy: 1885.75619871 hartree
xcener: -170.260549556151 hartree
chargesum: 0.0000000
charge: -0.183201 -0.180190 -0.184685 -0.175107 -0.166939 -0.175622 -0.309582 -0.525277 -0.228240 -0.035368 -0.162175 -0.112392 -0.053048 0.171263 -0.001128 -0.061502 -0.173610 -0.079202 -0.185205 -0.125600 -0.137881 -0.101752 -0.148556 0.549148 -0.183718 -0.177914 0.186087 0.207481 0.423603 -0.232080 -0.224959 0.171553 -0.132932 -0.127530 -0.117252 0.587135 0.111916 0.127225 0.139607 0.142353 0.151482 0.148628 0.153296 0.159161 0.155698 0.157236 0.172495 0.183893 0.157221 0.140400 0.152523 0.153240
qa: -0.1832 -0.1802 -0.1847 -0.1751 -0.1669 -0.1756 -0.3096 -0.5253 -0.2282 -0.0354 -0.1622 -0.1124 -0.0530 0.1713 -0.0011 -0.0615 -0.1736 -0.0792 -0.1852 -0.1256 -0.1379 -0.1018 -0.1486 0.5491 -0.1837 -0.1779 0.1861 0.2075 0.4236 -0.2321 -0.2250 0.1716 -0.1329 -0.1275 -0.1173 0.5871 0.1119 0.1272 0.1396 0.1424 0.1515 0.1486 0.1533 0.1592 0.1557 0.1572 0.1725 0.1839 0.1572 0.1404 0.1525 0.1532
va: 1.1101 1.1236 1.1127 1.1244 1.1380 1.1233 2.0829 1.9878 3.0082 3.1701 3.2207 3.1254 3.7865 3.7841 3.7005 3.7010 4.0482 3.7659 3.9790 3.9023 3.9310 3.9170 3.9554 4.4400 4.0199 4.0140 3.6104 3.8085 4.3298 3.9726 3.9663 3.7596 4.0377 4.0187 4.0114 4.6204 1.0092 1.0077 1.0245 1.0163 0.9954 1.0007 1.0044 0.9927 1.0043 1.0028 1.0348 1.0229 1.0331 1.0061 1.0015 0.9995
dispcorr: -0.024867292 hartree
energy: -1892.993959725971
dipole: -26.58339 25.75779 -0.82560 11.86407 -14.87253 -3.00846 -3.08338 3.29786 0.21447
magnitude: 3.12705 au
magnitude: 7.94833 debye
